program: Orca
programVersion: 5.0.4
elementType: S S P O O O O O N C C C C C C C C C C H H H H H H H H H H H H H H H H H H H H
charge: 0
multiplicity: 1
keywords: wb97x-d3
keywords: def2-TZVPP
keywords: def2/J RIJCOSX
keywords: DEFGRID2
keywords: scfconv7
keywords: smallprint printgap noloewdin
keywords: NOSOSCF
formula: C10H20NO5PS2
InChI: InChI=1/C10H20NO5PS2/c1-5-14-10(13)11(4)9(12)8-19-17(18,15-6-2)16-7-3/h5-8H2,1-4H3
39 atoms
S  -0.033248 -1.434127 0.363823
S  -2.856036 -0.078483 1.743674
P  -1.800618 -0.341499 0.153727
O  -1.253691 0.980742 -0.561228
O  -2.496852 -1.118679 -1.059349
O  3.645772 0.530907 -1.019585
O  0.595474 1.787956 2.002566
O  2.985628 -1.040433 0.420621
N  2.05731 1.070716 0.441384
C  0.672079 -0.550599 1.788814
C  1.117682 0.850057 1.437721
C  -1.940992 2.248438 -0.479851
C  -3.519268 -2.11943 -0.86173
C  2.178203 2.424868 -0.105223
C  2.90696 0.079055 -0.027212
C  -3.236394 2.255188 -1.251518
C  -2.960029 -3.424993 -0.355306
C  4.656617 -0.346789 -1.553516
C  5.396707 0.409322 -2.625063
H  1.477994 -1.171061 2.171248
H  -0.085012 -0.468377 2.567454
H  -1.233842 2.965712 -0.89267
H  -2.105579 2.500746 0.568846
H  -3.974114 -2.243925 -1.842858
H  -4.279548 -1.726767 -0.184665
H  3.167711 2.836283 0.079657
H  1.451601 3.068265 0.374311
H  1.979101 2.423525 -1.173924
H  -3.64597 3.265553 -1.241954
H  -3.981024 1.595547 -0.805307
H  -3.087731 1.964777 -2.291103
H  -2.179858 -3.810886 -1.011317
H  -3.763525 -4.161593 -0.323578
H  -2.556834 -3.335678 0.653759
H  4.182644 -1.24133 -1.959998
H  5.332245 -0.648394 -0.75156
H  5.883194 1.299913 -2.227719
H  6.171556 -0.236653 -3.037151
H  4.738654 0.702849 -3.442444
elementType: S P O N C H
totalener: -1961.98639046 hartree
nucrepener: 2137.88589595 hartree
electener: -4099.87228641 hartree
oneelecener: -6954.43542092 hartree
twoeener: 2854.56313451 hartree
cpcmener: -0.03311422 hartree
kineticenergy: 1956.36220535 hartree
xcener: -132.535465095555 hartree
chargesum: 0.0000000
charge: -0.149262 -0.449390 0.639245 -0.349921 -0.364246 -0.295070 -0.449729 -0.491315 -0.106057 -0.049704 0.256214 0.038524 0.047975 -0.187470 0.524796 -0.240097 -0.254226 0.034183 -0.251730 0.158204 0.128866 0.111627 0.094183 0.111848 0.094984 0.135021 0.110906 0.126023 0.099385 0.079014 0.092249 0.094503 0.104093 0.078572 0.102664 0.103155 0.089861 0.091709 0.090412
qa: -0.1493 -0.4494 0.6392 -0.3499 -0.3642 -0.2951 -0.4497 -0.4913 -0.1061 -0.0497 0.2562 0.0385 0.0480 -0.1875 0.5248 -0.2401 -0.2542 0.0342 -0.2517 0.1582 0.1289 0.1116 0.0942 0.1118 0.0950 0.1350 0.1109 0.1260 0.0994 0.0790 0.0922 0.0945 0.1041 0.0786 0.1027 0.1032 0.0899 0.0917 0.0904
va: 2.2943 1.9926 5.4135 2.0881 2.0907 2.1380 2.0342 1.9976 3.1673 3.7883 4.1017 3.8254 3.8310 3.8566 4.2287 3.9271 3.8992 3.8404 3.9697 1.0175 1.0504 0.9872 1.0148 0.9915 1.0141 0.9969 1.0212 0.9939 1.0077 1.0183 1.0064 1.0029 1.0108 1.0171 0.9956 0.9964 1.0028 1.0067 1.0028
dispcorr: -0.020092121 hartree
energy: -1962.006482582540
dipole: 4.87522 -3.71946 1.15576 3.74519 -3.54034 0.20485 -14.69307 12.44470 -2.24837
magnitude: 2.53631 au
magnitude: 6.44680 debye
