program: Orca
programVersion: 5.0.4
elementType: S S P O O O O O N C C C C C C C C C C H H H H H H H H H H H H H H H H H H H H
charge: 0
multiplicity: 1
keywords: wb97x-d3
keywords: def2-TZVPP
keywords: def2/J RIJCOSX
keywords: DEFGRID2
keywords: scfconv7
keywords: smallprint printgap noloewdin
keywords: NOSOSCF
formula: C10H20NO5PS2
InChI: InChI=1/C10H20NO5PS2/c1-5-14-10(13)11(4)9(12)8-19-17(18,15-6-2)16-7-3/h5-8H2,1-4H3
39 atoms
S  0.130915 0.98495 -0.856881
S  -2.590676 1.371276 1.191854
P  -1.574608 0.199318 0.051282
O  -2.324854 -0.408039 -1.22217
O  -0.953268 -1.095025 0.752489
O  3.143451 0.557067 -0.625797
O  1.083366 0.562651 2.716983
O  3.334538 -1.669157 -0.506904
N  2.189159 -0.550632 1.097861
C  0.976663 1.616293 0.621883
C  1.441155 0.522647 1.559395
C  -3.436177 0.250753 -1.865631
C  -1.637108 -1.793429 1.815806
C  2.186598 -1.785935 1.883147
C  2.912774 -0.618537 -0.084065
C  -3.012145 1.470801 -2.645049
C  -2.881842 -2.497757 1.334848
C  3.873957 0.604634 -1.868847
C  3.030293 0.230882 -3.063982
H  0.289746 2.250435 1.180884
H  1.791029 2.248737 0.27523
H  -4.187614 0.502741 -1.115665
H  -3.858438 -0.505681 -2.524268
H  -1.863255 -1.089743 2.618737
H  -0.904358 -2.506568 2.188415
H  3.194742 -2.04444 2.200286
H  1.774341 -2.605689 1.299611
H  1.577593 -1.651997 2.767836
H  -3.877063 1.864154 -3.179669
H  -2.244741 1.231248 -3.380893
H  -2.640328 2.263432 -1.994943
H  -3.659444 -1.796778 1.029517
H  -3.284465 -3.097147 2.151468
H  -2.665865 -3.167341 0.502724
H  4.763617 -0.02089 -1.793896
H  4.199352 1.640161 -1.939141
H  3.635412 0.35337 -3.962668
H  2.692573 -0.803921 -3.032262
H  2.16039 0.879491 -3.161325
elementType: S P O N C H
totalener: -1961.98366260 hartree
nucrepener: 2190.60230272 hartree
electener: -4152.58596533 hartree
oneelecener: -7059.21235730 hartree
twoeener: 2906.62639197 hartree
cpcmener: -0.03509006 hartree
kineticenergy: 1956.38189576 hartree
xcener: -132.539745847500 hartree
chargesum: -0.0000000
charge: -0.159878 -0.446263 0.641648 -0.363360 -0.342266 -0.300979 -0.443356 -0.490985 -0.099570 -0.029871 0.226750 0.051996 0.033143 -0.191704 0.503172 -0.255640 -0.238004 0.039837 -0.265229 0.128299 0.157280 0.095215 0.112816 0.098989 0.108185 0.139051 0.121841 0.111981 0.104966 0.094434 0.078346 0.078266 0.100647 0.092565 0.103353 0.112679 0.108614 0.095296 0.087733
qa: -0.1599 -0.4463 0.6416 -0.3634 -0.3423 -0.3010 -0.4434 -0.4910 -0.0996 -0.0299 0.2268 0.0520 0.0331 -0.1917 0.5032 -0.2556 -0.2380 0.0398 -0.2652 0.1283 0.1573 0.0952 0.1128 0.0990 0.1082 0.1391 0.1218 0.1120 0.1050 0.0944 0.0783 0.0783 0.1006 0.0926 0.1034 0.1127 0.1086 0.0953 0.0877
va: 2.2971 1.9969 5.4213 2.0901 2.0983 2.1150 2.0360 2.0121 3.1421 3.7880 4.1463 3.8204 3.8306 3.8592 4.2658 3.9023 3.9233 3.8168 3.9161 1.0477 1.0152 1.0128 0.9918 1.0137 0.9869 0.9970 0.9929 1.0185 1.0107 1.0032 1.0180 1.0169 1.0076 1.0064 1.0079 0.9961 1.0086 1.0131 1.0032
dispcorr: -0.022180730 hartree
energy: -1962.005843334405
dipole: -1.89981 2.07944 0.17962 -6.56144 6.59805 0.03661 -9.71725 8.01790 -1.69935
magnitude: 1.70921 au
magnitude: 4.34446 debye
