program: Orca
programVersion: 5.0.4
elementType: S S P O O O O O N C C C C C C C C C C H H H H H H H H H H H H H H H H H H H H
charge: 0
multiplicity: 1
keywords: wb97x-d3
keywords: def2-TZVPP
keywords: def2/J RIJCOSX
keywords: DEFGRID2
keywords: scfconv7
keywords: smallprint printgap noloewdin
keywords: NOSOSCF
formula: C10H20NO5PS2
InChI: InChI=1/C10H20NO5PS2/c1-5-14-10(13)11(4)9(12)8-19-17(18,15-6-2)16-7-3/h5-8H2,1-4H3
39 atoms
S  -1.336375 0.037349 -1.916897
S  0.17382 -1.93529 0.416604
P  -1.278255 -0.73163 0.034291
O  -1.273903 0.502608 1.04016
O  -2.772429 -1.282966 0.160685
O  3.295069 0.218806 0.771973
O  0.154062 2.630252 -1.332697
O  3.114521 -0.023182 -1.445461
N  1.791912 1.464223 -0.304399
C  0.429538 0.422322 -2.130442
C  0.798294 1.607034 -1.255005
C  -2.234278 1.586302 1.000456
C  -3.201913 -2.488673 -0.510137
C  1.814523 2.376802 0.840084
C  2.769687 0.482496 -0.402948
C  -3.27883 1.420131 2.074312
C  -4.404778 -3.0302 0.214921
C  4.365932 -0.74548 0.824586
C  4.795682 -0.869615 2.262182
H  0.54687 0.70352 -3.17822
H  0.991069 -0.488565 -1.965293
H  -2.689784 1.658039 0.010942
H  -1.652209 2.492567 1.160416
H  -2.387101 -3.215743 -0.511899
H  -3.44396 -2.244821 -1.545981
H  1.48428 1.87198 1.745782
H  1.148658 3.20843 0.644882
H  2.813187 2.778254 0.991479
H  -2.827088 1.346893 3.063359
H  -3.903908 0.544159 1.907732
H  -3.926675 2.29722 2.06978
H  -4.163448 -3.298632 1.243078
H  -4.749975 -3.928932 -0.295643
H  -5.2261 -2.31367 0.221647
H  5.190035 -0.406064 0.195328
H  4.006204 -1.70042 0.438919
H  5.168041 0.075766 2.656194
H  3.982727 -1.22005 2.897849
H  5.603965 -1.597615 2.324107
elementType: S P O N C H
totalener: -1961.98628199 hartree
nucrepener: 2154.48245978 hartree
electener: -4116.46874177 hartree
oneelecener: -6987.42860975 hartree
twoeener: 2870.95986798 hartree
cpcmener: -0.03354158 hartree
kineticenergy: 1956.34220727 hartree
xcener: -132.528225634387 hartree
chargesum: -0.0000000
charge: -0.156091 -0.435527 0.641912 -0.344475 -0.349298 -0.283919 -0.451952 -0.477321 -0.084601 -0.114569 0.296965 0.048439 0.036197 -0.181080 0.478424 -0.247306 -0.244343 0.030292 -0.246437 0.158360 0.133504 0.102413 0.103071 0.093828 0.102126 0.118002 0.115553 0.134968 0.088737 0.082629 0.096590 0.088532 0.092774 0.090092 0.108647 0.104504 0.090193 0.088834 0.091332
qa: -0.1561 -0.4355 0.6419 -0.3445 -0.3493 -0.2839 -0.4520 -0.4773 -0.0846 -0.1146 0.2970 0.0484 0.0362 -0.1811 0.4784 -0.2473 -0.2443 0.0303 -0.2464 0.1584 0.1335 0.1024 0.1031 0.0938 0.1021 0.1180 0.1156 0.1350 0.0887 0.0826 0.0966 0.0885 0.0928 0.0901 0.1086 0.1045 0.0902 0.0888 0.0913
va: 2.2752 2.0351 5.4343 2.0801 2.1144 2.1198 2.0444 2.0067 3.1223 3.8641 4.0683 3.8158 3.8437 3.8489 4.2801 3.9670 3.9630 3.8292 3.9690 1.0082 1.0509 1.0074 0.9908 1.0054 0.9928 0.9965 1.0193 0.9983 1.0039 1.0135 1.0055 1.0062 1.0064 1.0029 0.9980 0.9946 1.0028 1.0041 1.0065
dispcorr: -0.021095452 hartree
energy: -1962.007377438226
dipole: -2.92732 2.48118 -0.44614 -1.14203 1.12833 -0.01370 14.01565 -13.07340 0.94225
magnitude: 1.04262 au
magnitude: 2.65014 debye
