program: Orca
programVersion: 5.0.4
elementType: S S P O O O O O N C C C C C C C C C C H H H H H H H H H H H H H H H H H H H H
charge: 0
multiplicity: 1
keywords: wb97x-d3
keywords: def2-TZVPP
keywords: def2/J RIJCOSX
keywords: DEFGRID2
keywords: scfconv7
keywords: smallprint printgap noloewdin
keywords: NOSOSCF
formula: C10H20NO5PS2
InChI: InChI=1/C10H20NO5PS2/c1-5-14-10(13)11(4)9(12)8-19-17(18,15-6-2)16-7-3/h5-8H2,1-4H3
39 atoms
S  -1.299268 -0.06286 -1.547277
S  -0.652689 -1.214069 1.586336
P  -1.969284 -0.466483 0.400776
O  -2.611129 0.867689 0.985164
O  -3.286485 -1.331039 0.110365
O  4.326651 0.285392 0.329897
O  0.186413 1.945705 -0.04005
O  3.154353 -0.415002 -1.435269
N  2.258128 1.070038 0.083698
C  0.495719 -0.03851 -1.307794
C  0.95421 1.079022 -0.391461
C  -3.617334 1.628731 0.277118
C  -3.2060 -2.681662 -0.38798
C  2.616412 2.017845 1.142837
C  3.250157 0.242406 -0.426249
C  -3.306789 3.09613 0.410199
C  -4.478544 -3.397504 -0.019212
C  5.470204 -0.489236 -0.084008
C  6.556283 -0.275888 0.937317
H  0.902736 0.102072 -2.310171
H  0.819659 -1.014582 -0.954982
H  -4.583773 1.38422 0.717502
H  -3.651227 1.345877 -0.77745
H  -2.339296 -3.184072 0.047818
H  -3.069855 -2.648516 -1.470092
H  3.415389 2.679014 0.816429
H  2.924605 1.492102 2.042772
H  1.754135 2.624928 1.38486
H  -2.360279 3.348136 -0.066718
H  -3.268436 3.407611 1.453782
H  -4.092464 3.670871 -0.079755
H  -5.353722 -2.904785 -0.44257
H  -4.600829 -3.461416 1.061892
H  -4.442985 -4.412593 -0.413796
H  5.791714 -0.160179 -1.073259
H  5.191254 -1.542043 -0.144079
H  6.253599 -0.616952 1.927087
H  7.433231 -0.850755 0.641119
H  6.851155 0.771288 1.001733
elementType: S P O N C H
totalener: -1961.98848856 hartree
nucrepener: 2076.98685319 hartree
electener: -4038.97534175 hartree
oneelecener: -6833.13393900 hartree
twoeener: 2794.15859725 hartree
cpcmener: -0.03538132 hartree
kineticenergy: 1956.34753620 hartree
xcener: -132.531297214290 hartree
chargesum: -0.0000000
charge: -0.173207 -0.440927 0.648397 -0.349157 -0.343069 -0.294097 -0.452112 -0.492004 -0.112300 -0.048810 0.274516 0.026246 0.038265 -0.174971 0.527396 -0.234393 -0.241280 0.035831 -0.251155 0.159328 0.134209 0.108481 0.092365 0.091537 0.100236 0.130082 0.119391 0.113290 0.079255 0.091962 0.094480 0.089011 0.087111 0.088644 0.103126 0.102742 0.089569 0.092029 0.089982
qa: -0.1732 -0.4409 0.6484 -0.3492 -0.3431 -0.2941 -0.4521 -0.4920 -0.1123 -0.0488 0.2745 0.0262 0.0383 -0.1750 0.5274 -0.2344 -0.2413 0.0358 -0.2512 0.1593 0.1342 0.1085 0.0924 0.0915 0.1002 0.1301 0.1194 0.1133 0.0793 0.0920 0.0945 0.0890 0.0871 0.0886 0.1031 0.1027 0.0896 0.0920 0.0900
va: 2.2642 2.0182 5.4158 2.0961 2.0874 2.1370 2.0242 2.0061 3.2054 3.8057 4.1131 3.8753 3.8436 3.8518 4.2226 3.9388 3.9708 3.8383 3.9700 1.0118 1.0355 0.9963 0.9937 1.0039 0.9967 0.9954 0.9964 1.0249 1.0154 1.0041 1.0077 1.0034 1.0061 1.0063 0.9965 0.9957 1.0031 1.0065 1.0028
dispcorr: -0.018103181 hartree
energy: -1962.006591745233
dipole: 5.38018 -4.37618 1.00400 0.75448 -0.93739 -0.18290 1.74963 -2.61198 -0.86235
magnitude: 1.33608 au
magnitude: 3.39605 debye
