program: Orca
programVersion: 5.0.4
elementType: S S P O O O O O N C C C C C C C C C C H H H H H H H H H H H H H H H H H H H H
charge: 0
multiplicity: 1
keywords: wb97x-d3
keywords: def2-TZVPP
keywords: def2/J RIJCOSX
keywords: DEFGRID2
keywords: scfconv7
keywords: smallprint printgap noloewdin
keywords: NOSOSCF
formula: C10H20NO5PS2
InChI: InChI=1/C10H20NO5PS2/c1-5-14-10(13)11(4)9(12)8-19-17(18,15-6-2)16-7-3/h5-8H2,1-4H3
39 atoms
S  0.014095 -1.040575 0.365693
S  -2.877329 -0.644893 2.145407
P  -2.014178 -0.508869 0.432331
O  -2.13146 0.966654 -0.16416
O  -2.558038 -1.432409 -0.754965
O  3.717908 0.883647 -1.083636
O  0.404892 2.353024 1.552692
O  2.888209 -0.620459 0.342526
N  2.079887 1.539739 0.275493
C  0.656005 0.022612 1.699283
C  1.039577 1.387101 1.182302
C  -1.692924 1.321645 -1.495459
C  -3.224272 -2.69474 -0.540034
C  2.310514 2.870194 -0.295489
C  2.901247 0.492855 -0.126265
C  -1.539595 2.818716 -1.561377
C  -2.257881 -3.804711 -0.211652
C  4.635057 -0.088483 -1.626752
C  3.965265 -1.013882 -2.613597
H  1.479355 -0.506427 2.169524
H  -0.121133 0.162016 2.450434
H  -2.441021 0.976279 -2.210221
H  -0.746745 0.825069 -1.723385
H  -3.745038 -2.893942 -1.474725
H  -3.97288 -2.57883 0.245486
H  3.342049 3.177889 -0.145654
H  1.673466 3.587531 0.204828
H  2.077226 2.88381 -1.35789
H  -2.473357 3.328254 -1.322351
H  -1.257928 3.100111 -2.575877
H  -0.763358 3.177925 -0.88684
H  -1.778126 -3.657638 0.756187
H  -1.485448 -3.903682 -0.974438
H  -2.806587 -4.745925 -0.168047
H  5.115771 -0.63813 -0.817254
H  5.395301 0.513732 -2.119552
H  3.205667 -1.641121 -2.14937
H  3.507111 -0.457862 -3.431295
H  4.720858 -1.672707 -3.042119
elementType: S P O N C H
totalener: -1961.98702894 hartree
nucrepener: 2136.74445402 hartree
electener: -4098.73148297 hartree
oneelecener: -6951.61060687 hartree
twoeener: 2852.87912390 hartree
cpcmener: -0.03730237 hartree
kineticenergy: 1956.33780479 hartree
xcener: -132.531406408820 hartree
chargesum: -0.0000000
charge: -0.163120 -0.442054 0.625128 -0.346904 -0.349411 -0.297168 -0.459137 -0.488481 -0.108235 -0.016608 0.254431 0.023210 0.039918 -0.194419 0.529848 -0.256905 -0.245176 0.036024 -0.249837 0.154225 0.117803 0.121579 0.107387 0.108208 0.093385 0.133840 0.116635 0.128027 0.097036 0.094133 0.083060 0.076256 0.092622 0.103615 0.096782 0.110734 0.085823 0.089679 0.098064
qa: -0.1631 -0.4421 0.6251 -0.3469 -0.3494 -0.2972 -0.4591 -0.4885 -0.1082 -0.0166 0.2544 0.0232 0.0399 -0.1944 0.5298 -0.2569 -0.2452 0.0360 -0.2498 0.1542 0.1178 0.1216 0.1074 0.1082 0.0934 0.1338 0.1166 0.1280 0.0970 0.0941 0.0831 0.0763 0.0926 0.1036 0.0968 0.1107 0.0858 0.0897 0.0981
va: 2.2779 2.0219 5.4453 2.0997 2.0882 2.1397 2.0255 1.9941 3.1981 3.7528 4.1434 3.8058 3.8530 3.8503 4.2144 3.9474 3.8866 3.8470 3.9181 1.0185 1.0630 0.9992 1.0031 0.9904 1.0129 0.9997 1.0204 0.9911 1.0057 1.0060 1.0079 1.0167 1.0030 1.0113 1.0082 0.9958 1.0145 1.0043 1.0072
dispcorr: -0.020390619 hartree
energy: -1962.007419560003
dipole: 10.15616 -7.82674 2.32943 -0.41211 0.05110 -0.36101 -18.43660 15.30523 -3.13137
magnitude: 3.91944 au
magnitude: 9.96243 debye
