program: Orca
programVersion: 5.0.4
elementType: S S P O O O O O N C C C C C C C C C C H H H H H H H H H H H H H H H H H H H H
charge: 0
multiplicity: 1
keywords: wb97x-d3
keywords: def2-TZVPP
keywords: def2/J RIJCOSX
keywords: DEFGRID2
keywords: scfconv7
keywords: smallprint printgap noloewdin
keywords: NOSOSCF
formula: C10H20NO5PS2
InChI: InChI=1/C10H20NO5PS2/c1-5-14-10(13)11(4)9(12)8-19-17(18,15-6-2)16-7-3/h5-8H2,1-4H3
39 atoms
S  -1.543602 0.239215 1.869198
S  -3.488113 -0.721613 -0.560939
P  -1.643951 -0.437168 -0.100455
O  -0.778964 0.570934 -0.990155
O  -0.637167 -1.67068 -0.227429
O  2.938771 0.425795 -1.067884
O  0.327728 2.647876 1.669642
O  2.536725 -0.732085 0.801611
N  1.931654 1.487426 0.61181
C  0.259692 0.336409 2.115284
C  0.838438 1.568647 1.451496
C  -1.313733 1.871187 -1.335797
C  -0.923027 -2.91237 0.449314
C  2.372843 2.739318 -0.010271
C  2.473011 0.284364 0.153697
C  -1.836295 1.875866 -2.74866
C  0.248035 -3.836843 0.249755
C  3.601939 -0.695605 -1.685078
C  2.615079 -1.64083 -2.324469
H  0.714687 -0.608916 1.856033
H  0.393434 0.467353 3.192039
H  -0.48632 2.569235 -1.222343
H  -2.091129 2.164791 -0.62663
H  -1.838653 -3.3407 0.037376
H  -1.086875 -2.71932 1.512346
H  2.297459 3.542571 0.714652
H  1.773381 2.994312 -0.883237
H  3.414576 2.658375 -0.300933
H  -1.059566 1.597137 -3.460578
H  -2.172229 2.882753 -2.997846
H  -2.681816 1.199391 -2.867143
H  0.044677 -4.777978 0.760522
H  1.163875 -3.419415 0.667759
H  0.409662 -4.057579 -0.8052
H  4.23638 -1.200738 -0.956769
H  4.247043 -0.244497 -2.435994
H  3.167365 -2.429694 -2.835608
H  1.96027 -2.114943 -1.594556
H  1.999613 -1.131169 -3.06574
elementType: S P O N C H
totalener: -1961.98811867 hartree
nucrepener: 2202.90161546 hartree
electener: -4164.88973413 hartree
oneelecener: -7083.52047440 hartree
twoeener: 2918.63074028 hartree
cpcmener: -0.03588514 hartree
kineticenergy: 1956.34203523 hartree
xcener: -132.530177762665 hartree
chargesum: 0.0000000
charge: -0.138196 -0.438338 0.599191 -0.338154 -0.330322 -0.284021 -0.473251 -0.476563 -0.103489 -0.111523 0.297410 0.045572 0.017553 -0.181696 0.511218 -0.240609 -0.261138 0.037167 -0.230987 0.143739 0.158104 0.106834 0.093081 0.112167 0.107740 0.115125 0.129941 0.122928 0.090115 0.096698 0.076898 0.109541 0.085212 0.091527 0.097663 0.111288 0.100457 0.057943 0.093175
qa: -0.1382 -0.4383 0.5992 -0.3382 -0.3303 -0.2840 -0.4733 -0.4766 -0.1035 -0.1115 0.2974 0.0456 0.0176 -0.1817 0.5112 -0.2406 -0.2611 0.0372 -0.2310 0.1437 0.1581 0.1068 0.0931 0.1122 0.1077 0.1151 0.1299 0.1229 0.0901 0.0967 0.0769 0.1095 0.0852 0.0915 0.0977 0.1113 0.1005 0.0579 0.0932
va: 2.2955 2.0350 5.4795 2.0848 2.0930 2.1261 2.0194 2.0061 3.1666 3.8641 4.1160 3.8159 3.8245 3.8779 4.2261 3.9697 3.9455 3.8403 3.9314 1.0416 1.0080 0.9887 1.0108 1.0057 0.9948 1.0074 0.9874 1.0041 1.0043 1.0059 1.0189 1.0074 1.0091 0.9996 1.0083 0.9959 1.0116 1.0115 1.0063
dispcorr: -0.023432793 hartree
energy: -1962.011551459440
dipole: 15.22406 -12.33392 2.89014 -5.20997 4.84159 -0.36838 -13.80103 12.81415 -0.98688
magnitude: 3.07612 au
magnitude: 7.81889 debye
