program: Orca
programVersion: 5.0.4
elementType: S S P O O O O O N C C C C C C C C C C H H H H H H H H H H H H H H H H H H H H
charge: 0
multiplicity: 1
keywords: wb97x-d3
keywords: def2-TZVPP
keywords: def2/J RIJCOSX
keywords: DEFGRID2
keywords: scfconv7
keywords: smallprint printgap noloewdin
keywords: NOSOSCF
formula: C10H20NO5PS2
InChI: InChI=1/C10H20NO5PS2/c1-5-14-10(13)11(4)9(12)8-19-17(18,15-6-2)16-7-3/h5-8H2,1-4H3
39 atoms
S  -1.549636 0.236084 1.876574
S  -3.398206 -0.806939 -0.613044
P  -1.580175 -0.501909 -0.071999
O  -0.679375 0.470528 -0.963677
O  -0.570116 -1.736452 -0.109278
O  2.606811 0.5588 -1.17001
O  0.397126 2.662205 1.98276
O  2.466259 -0.676159 0.689174
N  1.840231 1.543799 0.676875
C  0.244001 0.32568 2.207747
C  0.837194 1.589123 1.621325
C  -1.18186 1.750657 -1.407097
C  -0.906088 -2.978196 0.543105
C  2.262661 2.822431 0.099124
C  2.313158 0.363059 0.096081
C  -0.934335 1.883897 -2.886393
C  0.257086 -3.920548 0.383341
C  3.209329 -0.519037 -1.915637
C  2.188124 -1.515641 -2.408086
H  0.716753 -0.606401 1.930515
H  0.323725 0.41307 3.293291
H  -0.659529 2.522536 -0.842593
H  -2.247865 1.838895 -1.186227
H  -1.809939 -3.387389 0.08799
H  -1.112348 -2.790558 1.599665
H  2.279439 3.577209 0.87807
H  1.594507 3.150805 -0.696326
H  3.270924 2.734313 -0.291086
H  0.125463 1.787833 -3.124947
H  -1.265223 2.868427 -3.217023
H  -1.490689 1.134989 -3.450181
H  0.016794 -4.863756 0.873723
H  1.161452 -3.523104 0.843934
H  0.459765 -4.132426 -0.666476
H  3.984621 -0.996782 -1.315789
H  3.692974 -0.019866 -2.752261
H  1.765369 -2.114161 -1.603995
H  1.377674 -1.023245 -2.945968
H  2.678708 -2.198101 -3.102354
elementType: S P O N C H
totalener: -1961.98846827 hartree
nucrepener: 2221.73560583 hartree
electener: -4183.72407411 hartree
oneelecener: -7121.03207995 hartree
twoeener: 2937.30800585 hartree
cpcmener: -0.03656531 hartree
kineticenergy: 1956.34271743 hartree
xcener: -132.529618169837 hartree
chargesum: 0.0000000
charge: -0.137757 -0.435418 0.586701 -0.325444 -0.322833 -0.280689 -0.483206 -0.468381 -0.104203 -0.120360 0.315846 0.018287 0.020152 -0.176564 0.492030 -0.234002 -0.262269 0.035267 -0.245746 0.143995 0.159581 0.107096 0.099796 0.109479 0.106858 0.115931 0.126094 0.121454 0.085245 0.098714 0.087486 0.108764 0.088603 0.090946 0.103816 0.112793 0.065367 0.088406 0.108164
qa: -0.1378 -0.4354 0.5867 -0.3254 -0.3228 -0.2807 -0.4832 -0.4684 -0.1042 -0.1204 0.3158 0.0183 0.0202 -0.1766 0.4920 -0.2340 -0.2623 0.0353 -0.2457 0.1440 0.1596 0.1071 0.0998 0.1095 0.1069 0.1159 0.1261 0.1215 0.0852 0.0987 0.0875 0.1088 0.0886 0.0909 0.1038 0.1128 0.0654 0.0884 0.1082
va: 2.2916 2.0419 5.4876 2.0896 2.0973 2.1128 2.0107 2.0158 3.1510 3.8623 4.1002 3.8189 3.8276 3.8809 4.2403 3.9476 3.9464 3.8282 3.9261 1.0428 1.0100 0.9934 1.0192 1.0062 0.9943 1.0092 0.9878 1.0034 1.0075 1.0082 1.0093 1.0072 1.0079 0.9996 1.0069 0.9961 1.0121 1.0062 1.0127
dispcorr: -0.024714740 hartree
energy: -1962.013183011552
dipole: 15.55645 -12.92866 2.62779 -4.79716 4.44430 -0.35287 -14.39628 13.19529 -1.20098
magnitude: 2.91070 au
magnitude: 7.39841 debye
