program: Orca
programVersion: 5.0.4
elementType: S S P O O O O O N C C C C C C C C C C H H H H H H H H H H H H H H H H H H H H
charge: 0
multiplicity: 1
keywords: wb97x-d3
keywords: def2-TZVPP
keywords: def2/J RIJCOSX
keywords: DEFGRID2
keywords: scfconv7
keywords: smallprint printgap noloewdin
keywords: NOSOSCF
formula: C10H20NO5PS2
InChI: InChI=1/C10H20NO5PS2/c1-5-14-10(13)11(4)9(12)8-19-17(18,15-6-2)16-7-3/h5-8H2,1-4H3
39 atoms
S  0.06943 1.119661 0.836208
S  -2.025069 -0.735087 2.58955
P  -1.62663 -0.08234 0.825612
O  -2.8030 0.718263 0.087016
O  -1.233703 -1.146555 -0.299996
O  3.626404 -0.615474 -0.430018
O  -0.016854 0.339527 -2.858389
O  2.812728 1.465359 -0.308845
N  1.775767 -0.146751 -1.5746
C  0.141347 1.64601 -0.90806
C  0.630733 0.580564 -1.862924
C  -3.740284 1.548137 0.802566
C  -2.134529 -2.219713 -0.661074
C  1.984189 -1.424669 -2.257203
C  2.752887 0.328454 -0.714218
C  -3.114536 2.804582 1.3567
C  -1.496259 -3.011041 -1.771818
C  4.731045 -0.280399 0.433327
C  4.336303 -0.287938 1.890243
H  0.773716 2.531336 -0.933196
H  -0.848203 1.952609 -1.241195
H  -4.203629 0.959796 1.596546
H  -4.508211 1.788743 0.069736
H  -3.09071 -1.802551 -0.981022
H  -2.308627 -2.844396 0.216871
H  1.160077 -1.605529 -2.93574
H  2.02193 -2.240745 -1.539764
H  2.902295 -1.410832 -2.840324
H  -2.404241 2.594376 2.155927
H  -3.903555 3.429845 1.775712
H  -2.608564 3.380628 0.581798
H  -0.544786 -3.442872 -1.461722
H  -1.333984 -2.398846 -2.658673
H  -2.160774 -3.829355 -2.048735
H  5.159446 0.676355 0.134198
H  5.468171 -1.054555 0.231324
H  5.228513 -0.121053 2.49423
H  3.620477 0.495753 2.133709
H  3.913749 -1.249445 2.1816
elementType: S P O N C H
totalener: -1961.98780815 hartree
nucrepener: 2158.64864862 hartree
electener: -4120.63645678 hartree
oneelecener: -6995.65075664 hartree
twoeener: 2875.01429986 hartree
cpcmener: -0.03276772 hartree
kineticenergy: 1956.35567271 hartree
xcener: -132.533601397994 hartree
chargesum: 0.0000000
charge: -0.145051 -0.446022 0.628470 -0.347910 -0.330223 -0.296195 -0.448694 -0.490013 -0.101097 -0.037568 0.236970 0.042841 0.024757 -0.194660 0.514426 -0.251658 -0.266121 0.039766 -0.250380 0.154638 0.127764 0.095660 0.111766 0.112171 0.096724 0.109054 0.126046 0.140534 0.076282 0.105723 0.095349 0.090610 0.088147 0.108274 0.096902 0.110218 0.098568 0.083652 0.090276
qa: -0.1451 -0.4460 0.6285 -0.3479 -0.3302 -0.2962 -0.4487 -0.4900 -0.1011 -0.0376 0.2370 0.0428 0.0248 -0.1947 0.5144 -0.2517 -0.2661 0.0398 -0.2504 0.1546 0.1278 0.0957 0.1118 0.1122 0.0967 0.1091 0.1260 0.1405 0.0763 0.1057 0.0953 0.0906 0.0881 0.1083 0.0969 0.1102 0.0986 0.0837 0.0903
va: 2.2893 2.0243 5.4239 2.0618 2.1124 2.1407 2.0308 1.9937 3.1366 3.7873 4.1705 3.8312 3.8599 3.8678 4.2446 3.9049 3.9479 3.8441 3.9192 1.0169 1.0435 1.0142 0.9919 0.9924 1.0003 1.0149 0.9931 0.9967 1.0158 1.0121 1.0021 1.0007 1.0076 1.0077 1.0088 0.9959 1.0081 1.0136 1.0040
dispcorr: -0.021241651 hartree
energy: -1962.009049805349
dipole: 3.66533 -3.05333 0.61200 -4.50415 4.06280 -0.44134 -4.04942 3.26454 -0.78487
magnitude: 1.08874 au
magnitude: 2.76736 debye
