program: Orca
programVersion: 5.0.4
elementType: S S P O O O O O N C C C C C C C C C C H H H H H H H H H H H H H H H H H H H H
charge: 0
multiplicity: 1
keywords: wb97x-d3
keywords: def2-TZVPP
keywords: def2/J RIJCOSX
keywords: DEFGRID2
keywords: scfconv7
keywords: smallprint printgap noloewdin
keywords: NOSOSCF
formula: C10H20NO5PS2
InChI: InChI=1/C10H20NO5PS2/c1-5-14-10(13)11(4)9(12)8-19-17(18,15-6-2)16-7-3/h5-8H2,1-4H3
39 atoms
S  -1.611686 0.681081 -2.036545
S  -2.967984 -1.996779 -0.635263
P  -1.523282 -0.736763 -0.512629
O  -0.025559 -1.2699 -0.627037
O  -1.441729 0.091969 0.861639
O  2.86481 0.053729 0.68121
O  -0.412806 2.938372 -0.259033
O  2.763948 0.712005 -1.450534
N  1.382549 1.63263 0.145524
C  0.066788 1.402642 -1.982152
C  0.337853 2.06815 -0.646819
C  0.397297 -2.538001 -0.073421
C  -2.618327 0.742837 1.382237
C  1.405087 2.034613 1.554092
C  2.37562 0.767288 -0.308478
C  0.363141 -2.567374 1.433918
C  -2.229864 1.550895 2.592443
C  3.948501 -0.85064 0.382775
C  4.336831 -1.539059 1.664219
H  0.051875 2.182797 -2.746099
H  0.774872 0.65149 -2.299541
H  1.411911 -2.667947 -0.445156
H  -0.221557 -3.331041 -0.497191
H  -3.355309 -0.018539 1.642796
H  -3.053623 1.384454 0.611816
H  2.419037 2.277109 1.859319
H  1.011183 1.248932 2.196435
H  0.80151 2.924833 1.679818
H  -0.654644 -2.543311 1.82343
H  0.92572 -1.742053 1.868958
H  0.819873 -3.498339 1.770785
H  -1.765678 0.928994 3.357909
H  -3.129472 1.991596 3.021923
H  -1.550547 2.363476 2.339453
H  4.786012 -0.286283 -0.030111
H  3.616972 -1.573404 -0.364224
H  4.681498 -0.829822 2.416555
H  3.511094 -2.118665 2.077677
H  5.155031 -2.227821 1.456407
elementType: S P O N C H
totalener: -1961.98650037 hartree
nucrepener: 2216.15697032 hartree
electener: -4178.14347069 hartree
oneelecener: -7109.73720179 hartree
twoeener: 2931.59373110 hartree
cpcmener: -0.03522044 hartree
kineticenergy: 1956.33923158 hartree
xcener: -132.529552016144 hartree
chargesum: -0.0000000
charge: -0.143956 -0.436946 0.597867 -0.331193 -0.320189 -0.281266 -0.462525 -0.474038 -0.070183 -0.105004 0.261389 0.000509 0.021963 -0.196803 0.491936 -0.249634 -0.262127 -0.001452 -0.244660 0.159455 0.140423 0.115359 0.115456 0.109256 0.108246 0.137729 0.118998 0.121004 0.091176 0.078666 0.110234 0.093845 0.104681 0.087792 0.123951 0.113386 0.092111 0.089244 0.095299
qa: -0.1440 -0.4369 0.5979 -0.3312 -0.3202 -0.2813 -0.4625 -0.4740 -0.0702 -0.1050 0.2614 0.0005 0.0220 -0.1968 0.4919 -0.2496 -0.2621 -0.0015 -0.2447 0.1595 0.1404 0.1154 0.1155 0.1093 0.1082 0.1377 0.1190 0.1210 0.0912 0.0787 0.1102 0.0938 0.1047 0.0878 0.1240 0.1134 0.0921 0.0892 0.0953
va: 2.2866 2.0373 5.4334 2.0969 2.0377 2.1093 2.0332 2.0138 3.1294 3.8611 4.1194 3.8355 3.8114 3.8647 4.2369 3.8822 3.9496 3.8257 3.9652 1.0055 1.0460 0.9890 1.0100 1.0097 0.9995 1.0025 0.9869 1.0121 1.0243 1.0071 1.0068 1.0030 1.0082 1.0051 1.0005 0.9897 1.0028 1.0013 1.0074
dispcorr: -0.024792849 hartree
energy: -1962.011293215300
dipole: 16.65902 -13.96196 2.69706 -4.17721 3.51325 -0.66397 21.91161 -19.85766 2.05395
magnitude: 3.45452 au
magnitude: 8.78069 debye
