program: Orca
programVersion: 5.0.4
elementType: S S P O O O O O N C C C C C C C C C C H H H H H H H H H H H H H H H H H H H H
charge: 0
multiplicity: 1
keywords: wb97x-d3
keywords: def2-TZVPP
keywords: def2/J RIJCOSX
keywords: DEFGRID2
keywords: scfconv7
keywords: smallprint printgap noloewdin
keywords: NOSOSCF
formula: C10H20NO5PS2
InChI: InChI=1/C10H20NO5PS2/c1-5-14-10(13)11(4)9(12)8-19-17(18,15-6-2)16-7-3/h5-8H2,1-4H3
39 atoms
S  0.281544 -1.211252 0.634534
S  -2.788274 -0.341671 1.884612
P  -1.689109 -0.602406 0.323713
O  -1.481783 0.671908 -0.613079
O  -2.165817 -1.717894 -0.718228
O  3.630826 0.811387 -1.140846
O  0.456694 2.337821 1.624392
O  3.144353 -0.480877 0.615525
N  2.010949 1.485963 0.225925
C  0.787186 0.023035 1.871632
C  1.08242 1.370417 1.253064
C  -2.567717 1.554164 -0.972957
C  -2.629713 -3.012383 -0.27541
C  2.035778 2.728721 -0.546184
C  2.951292 0.504218 -0.053697
C  -2.014051 2.94166 -1.161944
C  -4.129567 -3.108088 -0.381298
C  4.655031 -0.097793 -1.582651
C  4.086101 -1.276035 -2.336151
H  1.63969 -0.391552 2.403549
H  -0.018787 0.160206 2.592336
H  -3.330395 1.545106 -0.191247
H  -3.018841 1.176658 -1.89203
H  -2.300617 -3.209919 0.747458
H  -2.140358 -3.739415 -0.922784
H  1.87206 2.527475 -1.602081
H  2.982923 3.249797 -0.419723
H  1.244444 3.380068 -0.197206
H  -1.615646 3.342145 -0.230043
H  -2.814774 3.602625 -1.495098
H  -1.229699 2.962434 -1.919372
H  -4.472553 -2.92269 -1.399277
H  -4.623309 -2.405121 0.289054
H  -4.442819 -4.115013 -0.102545
H  5.264317 -0.416297 -0.735795
H  5.281539 0.507871 -2.235046
H  4.9108 -1.871483 -2.730047
H  3.483243 -1.925554 -1.702716
H  3.478927 -0.951527 -3.181645
elementType: S P O N C H
totalener: -1961.99494956 hartree
nucrepener: 2134.47112140 hartree
electener: -4096.46607096 hartree
oneelecener: -6947.42170782 hartree
twoeener: 2850.95563686 hartree
cpcmener: -0.02682881 hartree
kineticenergy: 1956.36585483 hartree
xcener: -132.532211305368 hartree
chargesum: -0.0000000
charge: -0.150861 -0.448653 0.638383 -0.330741 -0.357637 -0.294390 -0.425379 -0.470047 -0.113578 -0.043600 0.245894 0.039250 0.046759 -0.187442 0.508241 -0.254631 -0.237981 0.036283 -0.249589 0.154109 0.125309 0.087160 0.108934 0.086163 0.110057 0.122975 0.133530 0.109389 0.085353 0.103169 0.089918 0.089811 0.076350 0.093122 0.095947 0.106378 0.096919 0.086101 0.089027
qa: -0.1509 -0.4487 0.6384 -0.3307 -0.3576 -0.2944 -0.4254 -0.4700 -0.1136 -0.0436 0.2459 0.0392 0.0468 -0.1874 0.5082 -0.2546 -0.2380 0.0363 -0.2496 0.1541 0.1253 0.0872 0.1089 0.0862 0.1101 0.1230 0.1335 0.1094 0.0854 0.1032 0.0899 0.0898 0.0764 0.0931 0.0959 0.1064 0.0969 0.0861 0.0890
va: 2.2963 1.9981 5.4437 2.1089 2.0916 2.1387 2.0634 2.0153 3.1604 3.7881 4.1204 3.8411 3.8401 3.8657 4.2477 3.9308 3.9416 3.8544 3.9170 1.0159 1.0534 1.0125 0.9943 1.0103 0.9939 0.9954 0.9966 1.0194 1.0108 1.0095 1.0021 1.0036 1.0189 1.0081 1.0084 0.9957 1.0077 1.0141 1.0044
dispcorr: -0.019898298 hartree
energy: -1962.014847861300
dipole: 1.56361 -0.38498 1.17863 1.17754 -1.46860 -0.29105 -15.71977 13.40477 -2.31500
magnitude: 2.61402 au
magnitude: 6.64431 debye
