program: Orca
programVersion: 5.0.4
elementType: S S P O O O O O N C C C C C C C C C C H H H H H H H H H H H H H H H H H H H H
charge: 0
multiplicity: 1
keywords: wb97x-d3
keywords: def2-TZVPP
keywords: def2/J RIJCOSX
keywords: DEFGRID2
keywords: scfconv7
keywords: smallprint printgap noloewdin
keywords: NOSOSCF
formula: C10H20NO5PS2
InChI: InChI=1/C10H20NO5PS2/c1-5-14-10(13)11(4)9(12)8-19-17(18,15-6-2)16-7-3/h5-8H2,1-4H3
39 atoms
S  0.334737 0.537996 1.104873
S  -2.02616 -1.501361 2.185589
P  -1.469228 -0.417361 0.697517
O  -2.507626 0.697872 0.198413
O  -1.114947 -1.155141 -0.673738
O  3.095634 0.814909 -0.141205
O  0.137934 1.199222 -2.616435
O  3.561314 -1.220657 -0.937314
N  1.763368 -0.066967 -1.728703
C  0.509681 1.636125 -0.337354
C  0.807219 0.932685 -1.643471
C  -3.416383 1.371795 1.091555
C  -1.982874 -2.144163 -1.272205
C  1.667689 -0.941298 -2.895397
C  2.867099 -0.235153 -0.902208
C  -2.729564 2.341987 2.022041
C  -2.969989 -1.529162 -2.23299
C  4.212609 0.769225 0.768849
C  3.922066 -0.015151 2.025205
H  1.285182 2.354411 -0.076082
H  -0.408605 2.202734 -0.478798
H  -3.983872 0.627623 1.653901
H  -4.108776 1.893632 0.432712
H  -2.491026 -2.708976 -0.487077
H  -1.312122 -2.828971 -1.789012
H  2.07336 -0.45964 -3.784642
H  0.630808 -1.206862 -3.081482
H  2.220507 -1.854436 -2.708926
H  -2.091788 1.838602 2.748635
H  -3.492102 2.887712 2.579482
H  -2.130446 3.072502 1.477607
H  -3.496676 -2.329395 -2.754368
H  -2.46941 -0.915437 -2.982526
H  -3.716886 -0.919465 -1.726139
H  4.397919 1.815406 1.005266
H  5.090851 0.383422 0.250133
H  3.074482 0.397376 2.571961
H  3.729944 -1.068734 1.826598
H  4.795035 0.043939 2.676882
elementType: S P O N C H
totalener: -1961.99273359 hartree
nucrepener: 2180.24604575 hartree
electener: -4142.23877934 hartree
oneelecener: -7038.15171647 hartree
twoeener: 2895.91293713 hartree
cpcmener: -0.02954026 hartree
kineticenergy: 1956.34666768 hartree
xcener: -132.530235712244 hartree
chargesum: -0.0000000
charge: -0.158512 -0.436976 0.625480 -0.340776 -0.328669 -0.301812 -0.426172 -0.463106 -0.112797 -0.021213 0.217912 0.038984 0.024970 -0.170238 0.482187 -0.249926 -0.240644 0.038106 -0.259845 0.150446 0.129794 0.096555 0.109258 0.093250 0.109168 0.127113 0.100472 0.120079 0.079606 0.103963 0.092903 0.099165 0.088820 0.082827 0.109723 0.101505 0.086192 0.096386 0.105822
qa: -0.1585 -0.4370 0.6255 -0.3408 -0.3287 -0.3018 -0.4262 -0.4631 -0.1128 -0.0212 0.2179 0.0390 0.0250 -0.1702 0.4822 -0.2499 -0.2406 0.0381 -0.2598 0.1504 0.1298 0.0966 0.1093 0.0933 0.1092 0.1271 0.1005 0.1201 0.0796 0.1040 0.0929 0.0992 0.0888 0.0828 0.1097 0.1015 0.0862 0.0964 0.1058
va: 2.2805 2.0348 5.4308 2.0678 2.1050 2.1062 2.0587 2.0505 3.1293 3.7978 4.1905 3.8346 3.8508 3.8826 4.2907 3.9126 3.9302 3.8235 3.9138 1.0150 1.0404 1.0137 0.9913 1.0175 0.9866 0.9920 0.9975 1.0170 1.0160 1.0127 1.0015 1.0090 1.0058 1.0115 0.9960 1.0089 1.0041 1.0130 1.0088
dispcorr: -0.022181971 hartree
energy: -1962.014915562043
dipole: -1.27005 1.27144 0.00139 3.96671 -2.42975 1.53696 -2.88885 2.80911 -0.07973
magnitude: 1.53903 au
magnitude: 3.91189 debye
