program: Orca
programVersion: 5.0.4
elementType: S S P O O O O O N C C C C C C C C C C H H H H H H H H H H H H H H H H H H H H
charge: 0
multiplicity: 1
keywords: wb97x-d3
keywords: def2-TZVPP
keywords: def2/J RIJCOSX
keywords: DEFGRID2
keywords: scfconv7
keywords: smallprint printgap noloewdin
keywords: NOSOSCF
formula: C10H20NO5PS2
InChI: InChI=1/C10H20NO5PS2/c1-5-14-10(13)11(4)9(12)8-19-17(18,15-6-2)16-7-3/h5-8H2,1-4H3
39 atoms
S  -1.188253 -0.284106 1.925033
S  -4.021951 -0.516621 0.283329
P  -2.113601 -0.456064 0.064909
O  -1.496696 0.707841 -0.844818
O  -1.413457 -1.673216 -0.699415
O  3.921429 0.691194 -0.924807
O  0.491009 2.091451 1.567934
O  3.050046 -0.783487 0.512485
N  2.114881 1.297395 0.225495
C  0.562437 -0.27543 1.420041
C  1.045186 1.126272 1.099152
C  -2.010173 2.052209 -0.78297
C  -1.957767 -3.006239 -0.692354
C  2.368074 2.645786 -0.285434
C  3.038713 0.295423 -0.029263
C  -1.342698 2.856471 -1.866973
C  -1.80334 -3.709734 0.633388
C  4.943039 -0.2381 -1.32998
C  4.438391 -1.223116 -2.356502
H  0.712959 -0.986521 0.613589
H  1.115656 -0.656533 2.280899
H  -1.811764 2.477646 0.202594
H  -3.091931 2.031612 -0.929898
H  -1.405926 -3.528307 -1.472649
H  -3.006588 -2.968545 -0.993167
H  1.50922 3.273343 -0.079698
H  2.517909 2.620264 -1.361233
H  3.239799 3.094168 0.190082
H  -0.260115 2.890782 -1.738115
H  -1.714618 3.880572 -1.830692
H  -1.564383 2.455954 -2.857231
H  -2.126989 -4.745175 0.517391
H  -2.417628 -3.260021 1.413633
H  -0.765809 -3.722736 0.967777
H  5.358787 -0.742873 -0.45696
H  5.722657 0.392627 -1.753608
H  3.68443 -1.897062 -1.951395
H  4.021516 -0.712146 -3.22507
H  5.275025 -1.832515 -2.700882
elementType: S P O N C H
totalener: -1961.99643438 hartree
nucrepener: 2116.02997818 hartree
electener: -4078.02641256 hartree
oneelecener: -6909.81390708 hartree
twoeener: 2831.78749452 hartree
cpcmener: -0.02799586 hartree
kineticenergy: 1956.34003476 hartree
xcener: -132.529306495532 hartree
chargesum: 0.0000000
charge: -0.138134 -0.442453 0.612243 -0.340454 -0.344044 -0.296875 -0.418092 -0.476903 -0.108581 -0.066729 0.258101 0.011986 0.037986 -0.200095 0.515461 -0.256970 -0.251468 0.035251 -0.253016 0.124373 0.157519 0.112295 0.117626 0.109880 0.095899 0.108661 0.123751 0.141396 0.091071 0.092018 0.092880 0.103330 0.080019 0.092610 0.095342 0.107786 0.090053 0.089297 0.096978
qa: -0.1381 -0.4425 0.6122 -0.3405 -0.3440 -0.2969 -0.4181 -0.4769 -0.1086 -0.0667 0.2581 0.0120 0.0380 -0.2001 0.5155 -0.2570 -0.2515 0.0353 -0.2530 0.1244 0.1575 0.1123 0.1176 0.1099 0.0959 0.1087 0.1238 0.1414 0.0911 0.0920 0.0929 0.1033 0.0800 0.0926 0.0953 0.1078 0.0901 0.0893 0.0970
va: 2.2930 2.0229 5.4564 2.0935 2.0931 2.1377 2.0727 2.0226 3.1659 3.8268 4.1565 3.8001 3.8384 3.8700 4.2394 3.9681 3.9040 3.8551 3.9172 1.0442 1.0084 0.9994 1.0099 0.9921 1.0129 1.0141 0.9943 0.9948 0.9944 1.0057 1.0056 1.0111 1.0157 1.0034 1.0093 0.9954 1.0135 1.0038 1.0072
dispcorr: -0.020223157 hartree
energy: -1962.016657535889
dipole: 16.37122 -13.49493 2.87628 -1.32207 1.18197 -0.14010 -14.57781 12.78464 -1.79317
magnitude: 3.39236 au
magnitude: 8.62269 debye
