program: Orca
programVersion: 5.0.4
elementType: S S P O O O O O N C C C C C C C C C C H H H H H H H H H H H H H H H H H H H H
charge: 0
multiplicity: 1
keywords: wb97x-d3
keywords: def2-TZVPP
keywords: def2/J RIJCOSX
keywords: DEFGRID2
keywords: scfconv7
keywords: smallprint printgap noloewdin
keywords: NOSOSCF
formula: C10H20NO5PS2
InChI: InChI=1/C10H20NO5PS2/c1-5-14-10(13)11(4)9(12)8-19-17(18,15-6-2)16-7-3/h5-8H2,1-4H3
39 atoms
S  0.152816 -1.066089 1.192016
S  -2.881129 0.285085 2.045315
P  -1.710288 -0.304465 0.639007
O  -1.258219 0.814934 -0.419668
O  -2.319257 -1.525786 -0.187188
O  3.176686 0.276259 -1.365481
O  0.656747 2.647386 1.4784
O  3.022718 -0.497348 0.727008
N  1.917643 1.410757 0.073223
C  0.801525 0.380429 2.08295
C  1.133102 1.568682 1.205618
C  -2.092063 1.941912 -0.76001
C  -1.718388 -2.063308 -1.38938
C  1.900801 2.471747 -0.9334
C  2.734071 0.307054 -0.123969
C  -3.284714 1.54447 -1.594752
C  -1.319693 -3.49974 -1.169437
C  3.979757 -0.844643 -1.774518
C  3.122485 -2.02723 -2.156915
H  1.668834 0.031952 2.64076
H  0.058201 0.711972 2.807437
H  -1.435959 2.613352 -1.312005
H  -2.402037 2.45017 0.154883
H  -0.861117 -1.464442 -1.703274
H  -2.476016 -1.984244 -2.169144
H  2.892134 2.902185 -1.063817
H  1.234313 3.260504 -0.606357
H  1.543905 2.092712 -1.888183
H  -2.984174 1.015182 -2.499532
H  -3.820295 2.444804 -1.898898
H  -3.985233 0.920227 -1.038856
H  -0.936693 -3.909566 -2.104701
H  -2.169061 -4.109227 -0.860543
H  -0.532899 -3.59526 -0.420068
H  4.699097 -1.099759 -0.995943
H  4.535102 -0.476627 -2.635378
H  2.568264 -2.429829 -1.309218
H  2.414646 -1.764981 -2.943721
H  3.764592 -2.821538 -2.539068
elementType: S P O N C H
totalener: -1961.99369931 hartree
nucrepener: 2186.79639810 hartree
electener: -4148.79009741 hartree
oneelecener: -7051.22146731 hartree
twoeener: 2902.43136989 hartree
cpcmener: -0.03041045 hartree
kineticenergy: 1956.35389465 hartree
xcener: -132.530900389101 hartree
chargesum: -0.0000000
charge: -0.163772 -0.433159 0.615252 -0.332853 -0.349689 -0.292740 -0.421560 -0.464420 -0.103356 -0.024691 0.219150 0.043651 0.016956 -0.190921 0.493792 -0.245303 -0.226396 0.035684 -0.248555 0.152394 0.125634 0.104130 0.097761 0.096948 0.110186 0.137049 0.110280 0.120447 0.089873 0.104070 0.084774 0.094144 0.094930 0.075180 0.095663 0.107891 0.083391 0.089141 0.099044
qa: -0.1638 -0.4332 0.6153 -0.3329 -0.3497 -0.2927 -0.4216 -0.4644 -0.1034 -0.0247 0.2191 0.0437 0.0170 -0.1909 0.4938 -0.2453 -0.2264 0.0357 -0.2486 0.1524 0.1256 0.1041 0.0978 0.0969 0.1102 0.1370 0.1103 0.1204 0.0899 0.1041 0.0848 0.0941 0.0949 0.0752 0.0957 0.1079 0.0834 0.0891 0.0990
va: 2.2861 2.0281 5.4585 2.0532 2.0883 2.1333 2.0678 2.0213 3.1349 3.7857 4.1507 3.8177 3.8593 3.8605 4.2691 3.9224 3.9490 3.8513 3.9200 1.0158 1.0489 0.9869 1.0167 1.0005 0.9950 0.9965 1.0222 0.9938 1.0045 1.0090 1.0192 1.0066 1.0047 1.0087 1.0101 0.9954 1.0122 1.0037 1.0093
dispcorr: -0.022077696 hartree
energy: -1962.015777011261
dipole: 4.89231 -3.19631 1.69599 -4.82487 4.38111 -0.44376 -23.09292 19.50902 -3.58390
magnitude: 3.98969 au
magnitude: 10.14099 debye
