program: Orca
programVersion: 5.0.4
elementType: S S P O O O O O N C C C C C C C C C C H H H H H H H H H H H H H H H H H H H H
charge: 0
multiplicity: 1
keywords: wb97x-d3
keywords: def2-TZVPP
keywords: def2/J RIJCOSX
keywords: DEFGRID2
keywords: scfconv7
keywords: smallprint printgap noloewdin
keywords: NOSOSCF
formula: C10H20NO5PS2
InChI: InChI=1/C10H20NO5PS2/c1-5-14-10(13)11(4)9(12)8-19-17(18,15-6-2)16-7-3/h5-8H2,1-4H3
39 atoms
S  0.04732 -1.321875 0.555694
S  -2.983294 -0.202371 1.705642
P  -1.827049 -0.482289 0.189197
O  -1.415849 0.822722 -0.638579
O  -2.372268 -1.464325 -0.949579
O  3.499018 0.49686 -1.057814
O  0.501629 2.122102 1.853112
O  3.001935 -0.790181 0.695607
N  1.980312 1.249912 0.385264
C  0.609164 -0.226011 1.893699
C  1.038276 1.137132 1.398881
C  -2.387258 1.825322 -1.012605
C  -3.295531 -2.540539 -0.692866
C  2.105012 2.531041 -0.309812
C  2.845711 0.218196 0.051749
C  -1.721465 3.175726 -0.996135
C  -2.63193 -3.730929 -0.047277
C  4.483817 -0.4536 -1.504465
C  5.00961 0.024321 -2.831762
H  1.404783 -0.751687 2.416284
H  -0.207736 -0.076471 2.599371
H  -3.231242 1.806154 -0.319765
H  -2.759786 1.576998 -2.007564
H  -3.694323 -2.801321 -1.67226
H  -4.121099 -2.171352 -0.081427
H  1.403044 3.236413 0.117203
H  1.880366 2.419105 -1.368171
H  3.106474 2.941247 -0.194496
H  -0.876469 3.219317 -1.683883
H  -1.378144 3.438533 0.004154
H  -2.443233 3.9307 -1.310171
H  -2.283101 -3.510584 0.962052
H  -1.790026 -4.093537 -0.637419
H  -3.359014 -4.540814 0.027134
H  4.026417 -1.439184 -1.599941
H  5.2836 -0.517562 -0.764557
H  4.222854 0.067589 -3.584629
H  5.47648 1.00591 -2.755258
H  5.766322 -0.677512 -3.182894
elementType: S P O N C H
totalener: -1961.99581670 hartree
nucrepener: 2134.33820657 hartree
electener: -4096.33402327 hartree
oneelecener: -6947.11309272 hartree
twoeener: 2850.77906945 hartree
cpcmener: -0.02725046 hartree
kineticenergy: 1956.36555535 hartree
xcener: -132.532273189703 hartree
chargesum: 0.0000000
charge: -0.145897 -0.449348 0.639831 -0.332594 -0.358077 -0.292178 -0.422206 -0.467898 -0.107416 -0.046161 0.239467 0.037893 0.042250 -0.193535 0.502878 -0.255133 -0.250408 0.035241 -0.248736 0.155201 0.126547 0.086537 0.107580 0.107558 0.093987 0.110225 0.123880 0.136364 0.089530 0.085151 0.104959 0.079588 0.093070 0.101360 0.098578 0.103364 0.089417 0.088987 0.090143
qa: -0.1459 -0.4493 0.6398 -0.3326 -0.3581 -0.2922 -0.4222 -0.4679 -0.1074 -0.0462 0.2395 0.0379 0.0423 -0.1935 0.5029 -0.2551 -0.2504 0.0352 -0.2487 0.1552 0.1265 0.0865 0.1076 0.1076 0.0940 0.1102 0.1239 0.1364 0.0895 0.0852 0.1050 0.0796 0.0931 0.1014 0.0986 0.1034 0.0894 0.0890 0.0901
va: 2.2929 1.9985 5.4205 2.1085 2.1037 2.1369 2.0658 2.0231 3.1400 3.7927 4.1237 3.8470 3.8497 3.8657 4.2553 3.9313 3.8925 3.8442 3.9683 1.0158 1.0505 1.0119 0.9949 0.9913 1.0147 1.0188 0.9933 0.9975 1.0012 1.0118 1.0096 1.0169 1.0032 1.0114 0.9973 0.9959 1.0034 1.0027 1.0069
dispcorr: -0.019920248 hartree
energy: -1962.015736949010
dipole: 7.38883 -6.31550 1.07332 3.40846 -3.55970 -0.15125 -15.33949 12.94058 -2.39891
magnitude: 2.63243 au
magnitude: 6.69109 debye
