program: Orca
programVersion: 5.0.4
elementType: S S P O O O O O N C C C C C C C C C C H H H H H H H H H H H H H H H H H H H H
charge: 0
multiplicity: 1
keywords: wb97x-d3
keywords: def2-TZVPP
keywords: def2/J RIJCOSX
keywords: DEFGRID2
keywords: scfconv7
keywords: smallprint printgap noloewdin
keywords: NOSOSCF
formula: C10H20NO5PS2
InChI: InChI=1/C10H20NO5PS2/c1-5-14-10(13)11(4)9(12)8-19-17(18,15-6-2)16-7-3/h5-8H2,1-4H3
39 atoms
S  -0.007032 1.248113 0.828418
S  -2.252003 -0.419038 2.591308
P  -1.633173 -0.04972 0.808044
O  -2.711745 0.539174 -0.220021
O  -1.028453 -1.268839 -0.028585
O  3.585745 -0.755825 0.043993
O  0.160762 0.023772 -2.732877
O  2.865906 1.354108 -0.153408
N  1.820261 -0.371783 -1.251556
C  0.235328 1.557516 -0.950758
C  0.742667 0.363091 -1.728348
C  -3.78589 1.410954 0.177225
C  -1.74537 -2.506685 -0.227936
C  1.982532 -1.747655 -1.719149
C  2.775062 0.178686 -0.411845
C  -3.317366 2.791193 0.56838
C  -2.615881 -2.472853 -1.460414
C  4.708918 -0.354774 0.848444
C  5.858621 0.149587 0.008995
H  0.915917 2.404724 -1.016673
H  -0.705643 1.864426 -1.403211
H  -4.346548 0.943385 0.98925
H  -4.436387 1.457361 -0.695018
H  -2.32907 -2.740872 0.665614
H  -0.96947 -3.264895 -0.322771
H  2.911632 -1.870699 -2.272856
H  1.160921 -1.998742 -2.37956
H  1.969507 -2.440719 -0.880814
H  -2.717923 3.252827 -0.216932
H  -2.739822 2.786447 1.492611
H  -4.191881 3.422361 0.731971
H  -3.482383 -1.824372 -1.340462
H  -2.984134 -3.480866 -1.65593
H  -2.053544 -2.148175 -2.336527
H  4.991498 -1.262696 1.37835
H  4.396092 0.380957 1.589933
H  6.173526 -0.595029 -0.72259
H  5.618358 1.074399 -0.514522
H  6.708478 0.351686 0.662261
elementType: S P O N C H
totalener: -1961.99450607 hartree
nucrepener: 2156.78460489 hartree
electener: -4118.77911095 hartree
oneelecener: -6991.73260611 hartree
twoeener: 2872.95349516 hartree
cpcmener: -0.02754237 hartree
kineticenergy: 1956.35315202 hartree
xcener: -132.531959412242 hartree
chargesum: -0.0000000
charge: -0.143310 -0.439293 0.615681 -0.337677 -0.327122 -0.297268 -0.421804 -0.473917 -0.109483 -0.038317 0.223514 0.040405 0.028908 -0.189955 0.500633 -0.249661 -0.244611 0.037876 -0.250438 0.152923 0.127838 0.095263 0.107718 0.092643 0.106583 0.137243 0.108530 0.121590 0.093028 0.079300 0.103987 0.082917 0.100613 0.088432 0.108424 0.092763 0.088263 0.090573 0.097207
qa: -0.1433 -0.4393 0.6157 -0.3377 -0.3271 -0.2973 -0.4218 -0.4739 -0.1095 -0.0383 0.2235 0.0404 0.0289 -0.1900 0.5006 -0.2497 -0.2446 0.0379 -0.2504 0.1529 0.1278 0.0953 0.1077 0.0926 0.1066 0.1372 0.1085 0.1216 0.0930 0.0793 0.1040 0.0829 0.1006 0.0884 0.1084 0.0928 0.0883 0.0906 0.0972
va: 2.2852 2.0347 5.4342 2.0666 2.1017 2.1368 2.0622 2.0144 3.1199 3.7894 4.1864 3.8357 3.8546 3.8688 4.2624 3.9134 3.9297 3.8522 3.9176 1.0173 1.0405 1.0138 0.9911 1.0167 0.9876 0.9961 1.0171 0.9954 1.0014 1.0154 1.0126 1.0116 1.0088 1.0072 0.9948 1.0101 1.0049 1.0130 1.0069
dispcorr: -0.021444652 hartree
energy: -1962.015950718612
dipole: 4.65678 -3.95016 0.70662 -3.81386 3.14877 -0.66509 -8.64253 7.79892 -0.84361
magnitude: 1.28582 au
magnitude: 3.26829 debye
