program: Orca
programVersion: 5.0.4
elementType: S S P O O O O O N C C C C C C C C C C H H H H H H H H H H H H H H H H H H H H
charge: 0
multiplicity: 1
keywords: wb97x-d3
keywords: def2-TZVPP
keywords: def2/J RIJCOSX
keywords: DEFGRID2
keywords: scfconv7
keywords: smallprint printgap noloewdin
keywords: NOSOSCF
formula: C10H20NO5PS2
InChI: InChI=1/C10H20NO5PS2/c1-5-14-10(13)11(4)9(12)8-19-17(18,15-6-2)16-7-3/h5-8H2,1-4H3
39 atoms
S  -1.23055 0.506719 -1.600964
S  -0.588935 0.692971 1.724455
P  -1.876702 0.216887 0.376437
O  -3.272774 1.001296 0.348497
O  -2.37429 -1.287163 0.525866
O  4.296111 -0.270664 0.315003
O  0.315054 -1.879094 -0.952076
O  3.222502 0.883251 -1.272424
N  2.324382 -1.035263 -0.379749
C  0.568592 0.440465 -1.390429
C  1.047608 -0.919215 -0.913907
C  -3.318057 2.443696 0.351431
C  -3.365311 -1.871417 -0.346415
C  2.6657 -2.26682 0.334317
C  3.28715 -0.043883 -0.50276
C  -3.679322 2.961284 1.720349
C  -3.121969 -3.355482 -0.423161
C  5.383641 0.671991 0.33366
C  5.061629 1.891192 1.164352
H  0.873451 1.245201 -0.726669
H  0.973024 0.658688 -2.380436
H  -4.069862 2.720863 -0.387074
H  -2.363973 2.859575 0.017533
H  -3.307773 -1.428644 -1.344103
H  -4.353069 -1.653862 0.062354
H  1.860974 -2.981371 0.213439
H  2.796656 -2.074607 1.397576
H  3.573532 -2.709286 -0.069258
H  -4.635544 2.562644 2.060012
H  -3.766191 4.047919 1.680893
H  -2.915533 2.711782 2.456459
H  -3.168694 -3.82249 0.561076
H  -2.154797 -3.57992 -0.872462
H  -3.894829 -3.809901 -1.043781
H  5.666002 0.94036 -0.685088
H  6.209461 0.115076 0.772742
H  5.951117 2.519485 1.225877
H  4.262732 2.491596 0.730607
H  4.779793 1.616193 2.18106
elementType: S P O N C H
totalener: -1961.99591810 hartree
nucrepener: 2101.28134214 hartree
electener: -4063.27726024 hartree
oneelecener: -6881.55144277 hartree
twoeener: 2818.27418252 hartree
cpcmener: -0.02757944 hartree
kineticenergy: 1956.33922405 hartree
xcener: -132.528647751566 hartree
chargesum: 0.0000000
charge: -0.173449 -0.438685 0.649802 -0.344907 -0.334301 -0.294058 -0.424967 -0.472376 -0.114030 -0.056047 0.256923 0.039849 0.018137 -0.174274 0.509917 -0.236669 -0.236123 0.034677 -0.250732 0.132871 0.156651 0.108408 0.082803 0.099526 0.106139 0.114593 0.118307 0.124541 0.088823 0.092567 0.075119 0.089037 0.085251 0.089350 0.094892 0.107431 0.096036 0.090004 0.088962
qa: -0.1734 -0.4387 0.6498 -0.3449 -0.3343 -0.2941 -0.4250 -0.4724 -0.1140 -0.0560 0.2569 0.0398 0.0181 -0.1743 0.5099 -0.2367 -0.2361 0.0347 -0.2507 0.1329 0.1567 0.1084 0.0828 0.0995 0.1061 0.1146 0.1183 0.1245 0.0888 0.0926 0.0751 0.0890 0.0853 0.0894 0.0949 0.1074 0.0960 0.0900 0.0890
va: 2.2670 2.0180 5.4179 2.0812 2.1151 2.1342 2.0602 2.0254 3.1862 3.8007 4.1427 3.8593 3.8642 3.8542 4.2451 3.9423 3.9492 3.8555 3.9157 1.0371 1.0118 0.9929 1.0096 0.9969 0.9971 1.0249 0.9963 0.9967 1.0039 1.0079 1.0202 1.0039 1.0119 1.0070 1.0088 0.9953 1.0075 1.0139 1.0042
dispcorr: -0.018855800 hartree
energy: -1962.014773904345
dipole: 3.52310 -2.78040 0.74270 1.60298 -1.16220 0.44078 4.93785 -5.31334 -0.37549
magnitude: 0.94175 au
magnitude: 2.39373 debye
