program: Orca
programVersion: 5.0.4
elementType: S S P O O O O O N C C C C C C C C C C H H H H H H H H H H H H H H H H H H H H
charge: 0
multiplicity: 1
keywords: wb97x-d3
keywords: def2-TZVPP
keywords: def2/J RIJCOSX
keywords: DEFGRID2
keywords: scfconv7
keywords: smallprint printgap noloewdin
keywords: NOSOSCF
formula: C10H20NO5PS2
InChI: InChI=1/C10H20NO5PS2/c1-5-14-10(13)11(4)9(12)8-19-17(18,15-6-2)16-7-3/h5-8H2,1-4H3
39 atoms
S  -1.290524 0.107773 -1.506272
S  -0.591913 -1.211029 1.555871
P  -1.914144 -0.36272 0.441378
O  -2.518035 0.947186 1.111068
O  -3.249257 -1.201421 0.153057
O  4.336059 0.161449 0.323561
O  0.271188 2.017201 0.052428
O  3.166528 -0.300385 -1.520454
N  2.312089 1.0660 0.123985
C  0.510792 0.089045 -1.314061
C  1.007994 1.145781 -0.344816
C  -3.131425 2.053501 0.417103
C  -3.205167 -2.550588 -0.344012
C  2.694781 1.913199 1.255446
C  3.274216 0.24726 -0.450673
C  -4.477644 1.727605 -0.181628
C  -4.501393 -3.22849 0.016547
C  5.445206 -0.625135 -0.148968
C  6.508071 -0.594328 0.917651
H  0.896414 0.278961 -2.316963
H  0.823775 -0.911718 -1.026814
H  -2.445397 2.426872 -0.344503
H  -3.23066 2.824815 1.179371
H  -2.356492 -3.08002 0.096037
H  -3.061954 -2.523788 -1.426215
H  1.859592 2.549033 1.521357
H  3.536658 2.551184 0.994567
H  2.952333 1.307784 2.121764
H  -5.160476 1.309082 0.557598
H  -4.410193 1.040398 -1.025087
H  -4.918455 2.653419 -0.554179
H  -4.633461 -3.286028 1.097277
H  -4.494939 -4.245775 -0.37535
H  -5.359615 -2.71065 -0.412838
H  5.81648 -0.205613 -1.085926
H  5.112121 -1.646866 -0.338954
H  6.863772 0.41882 1.106842
H  6.150824 -1.020936 1.855219
H  7.359088 -1.188582 0.584725
elementType: S P O N C H
totalener: -1961.99564693 hartree
nucrepener: 2085.76367109 hartree
electener: -4047.75931802 hartree
oneelecener: -6850.34785648 hartree
twoeener: 2802.58853846 hartree
cpcmener: -0.02776366 hartree
kineticenergy: 1956.34519057 hartree
xcener: -132.530896580527 hartree
chargesum: -0.0000000
charge: -0.171368 -0.446135 0.647588 -0.342299 -0.337406 -0.292217 -0.428057 -0.470050 -0.113063 -0.052628 0.263838 0.019450 0.034224 -0.175556 0.507820 -0.230109 -0.240023 0.036853 -0.248790 0.156703 0.132569 0.094116 0.110768 0.091503 0.097701 0.114661 0.126784 0.118061 0.092331 0.072981 0.098421 0.086939 0.087050 0.087943 0.101012 0.099803 0.088902 0.089070 0.090610
qa: -0.1714 -0.4461 0.6476 -0.3423 -0.3374 -0.2922 -0.4281 -0.4701 -0.1131 -0.0526 0.2638 0.0194 0.0342 -0.1756 0.5078 -0.2301 -0.2400 0.0369 -0.2488 0.1567 0.1326 0.0941 0.1108 0.0915 0.0977 0.1147 0.1268 0.1181 0.0923 0.0730 0.0984 0.0869 0.0870 0.0879 0.1010 0.0998 0.0889 0.0891 0.0906
va: 2.2667 2.0161 5.4178 2.1121 2.0902 2.1342 2.0493 2.0319 3.1953 3.8235 4.1245 3.8660 3.8473 3.8536 4.2458 3.9148 3.9695 3.8425 3.9694 1.0126 1.0360 1.0090 0.9888 1.0071 0.9968 1.0251 0.9961 0.9965 1.0057 1.0117 1.0087 1.0063 1.0066 1.0032 0.9967 0.9965 1.0030 1.0033 1.0069
dispcorr: -0.018581844 hartree
energy: -1962.014228775184
dipole: 3.25941 -2.19066 1.06875 -2.47727 2.44544 -0.03183 0.64558 -1.46978 -0.82420
magnitude: 1.35002 au
magnitude: 3.43148 debye
