program: Orca
programVersion: 5.0.4
elementType: S S P O O O O O N C C C C C C C C C C H H H H H H H H H H H H H H H H H H H H
charge: 0
multiplicity: 1
keywords: wb97x-d3
keywords: def2-TZVPP
keywords: def2/J RIJCOSX
keywords: DEFGRID2
keywords: scfconv7
keywords: smallprint printgap noloewdin
keywords: NOSOSCF
formula: C10H20NO5PS2
InChI: InChI=1/C10H20NO5PS2/c1-5-14-10(13)11(4)9(12)8-19-17(18,15-6-2)16-7-3/h5-8H2,1-4H3
39 atoms
S  0.271265 -1.218243 0.812245
S  -2.710345 0.072296 1.88014
P  -1.605531 -0.412864 0.378017
O  -1.220345 0.764272 -0.631871
O  -2.183164 -1.517467 -0.623422
O  3.546515 0.67022 -1.233317
O  0.559539 2.371518 1.633345
O  3.21366 -0.472391 0.658862
N  2.010726 1.431253 0.182203
C  0.865783 0.062676 1.96092
C  1.14872 1.378727 1.270264
C  -2.063175 1.919379 -0.832508
C  -2.87271 -2.699942 -0.169945
C  1.953325 2.607193 -0.686236
C  2.951001 0.445592 -0.078596
C  -3.320475 1.589977 -1.599042
C  -3.985462 -3.008511 -1.137208
C  4.567599 -0.248412 -1.661768
C  3.988154 -1.496634 -2.282612
H  1.739213 -0.347348 2.461696
H  0.102489 0.24656 2.716309
H  -1.439543 2.618807 -1.387582
H  -2.295431 2.370494 0.134147
H  -3.269533 -2.540381 0.835024
H  -2.150428 -3.516597 -0.122305
H  2.901691 3.141394 -0.689363
H  1.190342 3.282719 -0.319274
H  1.696276 2.320092 -1.703687
H  -3.096791 1.110969 -2.552492
H  -3.859566 2.515123 -1.807821
H  -3.989723 0.943237 -1.030404
H  -4.489372 -3.922626 -0.821923
H  -3.609926 -3.16675 -2.148562
H  -4.725454 -2.207888 -1.159537
H  5.233468 -0.482679 -0.83034
H  5.139261 0.315463 -2.396903
H  3.436541 -2.102326 -1.564437
H  3.328307 -1.256754 -3.116783
H  4.804786 -2.10649 -2.671536
elementType: S P O N C H
totalener: -1961.99517260 hartree
nucrepener: 2146.25765420 hartree
electener: -4108.25282680 hartree
oneelecener: -6970.91690853 hartree
twoeener: 2862.66408173 hartree
cpcmener: -0.02693664 hartree
kineticenergy: 1956.35347312 hartree
xcener: -132.530909281808 hartree
chargesum: -0.0000000
charge: -0.151822 -0.443732 0.627931 -0.338577 -0.350877 -0.294582 -0.419057 -0.470986 -0.109802 -0.053908 0.239735 0.040164 0.042225 -0.188505 0.504037 -0.236285 -0.238176 0.036645 -0.249969 0.156067 0.129940 0.107497 0.097009 0.088002 0.104273 0.134027 0.109589 0.122778 0.091841 0.097954 0.075947 0.090940 0.090237 0.085743 0.094672 0.106873 0.086379 0.088887 0.096883
qa: -0.1518 -0.4437 0.6279 -0.3386 -0.3509 -0.2946 -0.4191 -0.4710 -0.1098 -0.0539 0.2397 0.0402 0.0422 -0.1885 0.5040 -0.2363 -0.2382 0.0366 -0.2500 0.1561 0.1299 0.1075 0.0970 0.0880 0.1043 0.1340 0.1096 0.1228 0.0918 0.0980 0.0759 0.0909 0.0902 0.0857 0.0947 0.1069 0.0864 0.0889 0.0969
va: 2.2977 2.0004 5.4397 2.0931 2.1062 2.1368 2.0694 2.0167 3.1470 3.7893 4.1162 3.8221 3.8366 3.8606 4.2572 3.9300 3.9476 3.8546 3.9172 1.0163 1.0484 0.9873 1.0146 1.0118 0.9926 0.9973 1.0220 0.9938 1.0059 1.0087 1.0186 1.0076 1.0038 1.0061 1.0090 0.9955 1.0142 1.0042 1.0078
dispcorr: -0.020340524 hartree
energy: -1962.015513121942
dipole: -1.48185 2.43719 0.95535 -2.35941 1.98181 -0.37760 -18.36365 16.02981 -2.33384
magnitude: 2.54991 au
magnitude: 6.48137 debye
