program: Orca
programVersion: 5.0.4
elementType: S S P O O O O O N C C C C C C C C C C H H H H H H H H H H H H H H H H H H H H
charge: 0
multiplicity: 1
keywords: wb97x-d3
keywords: def2-TZVPP
keywords: def2/J RIJCOSX
keywords: DEFGRID2
keywords: scfconv7
keywords: smallprint printgap noloewdin
keywords: NOSOSCF
formula: C10H20NO5PS2
InChI: InChI=1/C10H20NO5PS2/c1-5-14-10(13)11(4)9(12)8-19-17(18,15-6-2)16-7-3/h5-8H2,1-4H3
39 atoms
S  0.152904 -1.23944 0.629678
S  -2.996609 -0.173626 1.492049
P  -1.715377 -0.490634 0.087525
O  -1.287003 0.778576 -0.785753
O  -2.138423 -1.54944 -1.034787
O  3.47062 0.712919 -1.116296
O  0.411238 2.320722 1.728431
O  3.050316 -0.497388 0.716331
N  1.88109 1.430579 0.262922
C  0.619743 -0.016208 1.891122
C  0.975739 1.335206 1.312338
C  -2.277167 1.704655 -1.293228
C  -3.032327 -2.652294 -0.792102
C  1.873097 2.645902 -0.550602
C  2.825403 0.449548 0.003083
C  -2.327873 2.961297 -0.46171
C  -2.354982 -3.794367 -0.076927
C  4.478609 -0.215535 -1.554712
C  3.879041 -1.4125 -2.252483
H  1.440409 -0.453027 2.455962
H  -0.213016 0.129694 2.578707
H  -3.259438 1.228621 -1.341187
H  -1.969527 1.9230 -2.315798
H  -3.368776 -2.958328 -1.781715
H  -3.902698 -2.299725 -0.235214
H  1.697147 2.403378 -1.596094
H  2.810888 3.190677 -0.457794
H  1.073104 3.294567 -0.214808
H  -2.654888 2.755835 0.557366
H  -3.042945 3.652434 -0.910338
H  -1.359868 3.461855 -0.427222
H  -2.07148 -3.530845 0.942585
H  -1.466957 -4.133939 -0.610746
H  -3.048839 -4.633861 -0.017649
H  5.108294 -0.510899 -0.714601
H  5.091599 0.36359 -2.243187
H  4.686146 -2.034257 -2.642088
H  3.281473 -2.028967 -1.581798
H  3.257123 -1.110237 -3.09547
elementType: S P O N C H
totalener: -1961.99389141 hartree
nucrepener: 2162.50425790 hartree
electener: -4124.49814931 hartree
oneelecener: -7003.46281825 hartree
twoeener: 2878.96466894 hartree
cpcmener: -0.02719154 hartree
kineticenergy: 1956.35902805 hartree
xcener: -132.532408641367 hartree
chargesum: -0.0000000
charge: -0.144713 -0.448728 0.638798 -0.338918 -0.356934 -0.294077 -0.417279 -0.470007 -0.110828 -0.041218 0.234741 0.028398 0.043046 -0.191063 0.501658 -0.247911 -0.250396 0.036177 -0.249308 0.154171 0.125107 0.099600 0.109743 0.106701 0.093995 0.122671 0.136214 0.109479 0.082057 0.104930 0.086583 0.079252 0.092884 0.101431 0.095340 0.106717 0.097039 0.085546 0.089099
qa: -0.1447 -0.4487 0.6388 -0.3389 -0.3569 -0.2941 -0.4173 -0.4700 -0.1108 -0.0412 0.2347 0.0284 0.0430 -0.1911 0.5017 -0.2479 -0.2504 0.0362 -0.2493 0.1542 0.1251 0.0996 0.1097 0.1067 0.0940 0.1227 0.1362 0.1095 0.0821 0.1049 0.0866 0.0793 0.0929 0.1014 0.0953 0.1067 0.0970 0.0855 0.0891
va: 2.2956 1.9917 5.4191 2.0924 2.1042 2.1376 2.0677 2.0172 3.1284 3.8025 4.1275 3.8521 3.8483 3.8695 4.2624 3.9203 3.8919 3.8528 3.9179 1.0160 1.0493 1.0067 0.9966 0.9914 1.0157 0.9944 0.9966 1.0147 1.0189 1.0108 1.0002 1.0167 1.0032 1.0115 1.0090 0.9957 1.0080 1.0139 1.0043
dispcorr: -0.021052415 hartree
energy: -1962.014943825182
dipole: 3.84130 -2.86356 0.97774 -0.61924 0.28221 -0.33703 -13.35669 10.92509 -2.43159
magnitude: 2.64239 au
magnitude: 6.71642 debye
