program: Orca
programVersion: 5.0.4
elementType: S S P O O O O O N C C C C C C C C C C H H H H H H H H H H H H H H H H H H H H
charge: 0
multiplicity: 1
keywords: wb97x-d3
keywords: def2-TZVPP
keywords: def2/J RIJCOSX
keywords: DEFGRID2
keywords: scfconv7
keywords: smallprint printgap noloewdin
keywords: NOSOSCF
formula: C10H20NO5PS2
InChI: InChI=1/C10H20NO5PS2/c1-5-14-10(13)11(4)9(12)8-19-17(18,15-6-2)16-7-3/h5-8H2,1-4H3
39 atoms
S  0.236633 -1.267415 0.187025
S  -2.502324 -0.271131 1.981856
P  -1.645298 -0.366596 0.259698
O  -1.336245 1.031778 -0.450473
O  -2.404155 -1.180753 -0.888279
O  3.086196 -0.4197 -0.238867
O  0.877159 1.969598 1.936816
O  3.031312 1.045361 -1.927254
N  1.897615 1.48779 -0.015241
C  1.049203 -0.334181 1.51857
C  1.290514 1.122047 1.178387
C  -2.185695 2.185787 -0.271816
C  -3.303554 -2.272247 -0.60766
C  1.699476 2.851496 -0.503471
C  2.699392 0.694512 -0.821981
C  -3.540752 2.018572 -0.914058
C  -2.580162 -3.527078 -0.185525
C  3.900358 -1.338287 -0.991631
C  5.363799 -0.97444 -0.922713
H  1.966117 -0.865243 1.765879
H  0.415576 -0.356408 2.404674
H  -1.635223 3.003174 -0.734729
H  -2.277558 2.402506 0.794156
H  -3.843467 -2.429028 -1.540094
H  -4.024761 -1.959962 0.149927
H  1.03753 3.384122 0.167887
H  1.251407 2.836925 -1.494436
H  2.644534 3.390455 -0.548054
H  -3.457731 1.778716 -1.974188
H  -4.088305 2.957787 -0.825785
H  -4.137019 1.247392 -0.424742
H  -2.080982 -3.410523 0.77687
H  -1.843735 -3.837536 -0.927153
H  -3.307225 -4.33328 -0.080659
H  3.546023 -1.397703 -2.021073
H  3.72102 -2.303179 -0.520355
H  5.94256 -1.740933 -1.439592
H  5.576908 -0.01969 -1.402543
H  5.714898 -0.933416 0.108698
elementType: S P O N C H
totalener: -1961.99285882 hartree
nucrepener: 2167.35520639 hartree
electener: -4129.34806521 hartree
oneelecener: -7012.58963880 hartree
twoeener: 2883.24157359 hartree
cpcmener: -0.02880425 hartree
kineticenergy: 1956.37311733 hartree
xcener: -132.535090731539 hartree
chargesum: 0.0000000
charge: -0.156191 -0.440973 0.634629 -0.340574 -0.356437 -0.305334 -0.417891 -0.466871 -0.103227 -0.034862 0.212909 0.034444 0.048010 -0.190706 0.495257 -0.238019 -0.253338 0.044286 -0.248113 0.151409 0.129351 0.106323 0.097812 0.110046 0.094398 0.111759 0.121039 0.136271 0.092640 0.098240 0.079162 0.079750 0.093400 0.102289 0.100949 0.103259 0.096658 0.089398 0.088848
qa: -0.1562 -0.4410 0.6346 -0.3406 -0.3564 -0.3053 -0.4179 -0.4669 -0.1032 -0.0349 0.2129 0.0344 0.0480 -0.1907 0.4953 -0.2380 -0.2533 0.0443 -0.2481 0.1514 0.1294 0.1063 0.0978 0.1100 0.0944 0.1118 0.1210 0.1363 0.0926 0.0982 0.0792 0.0798 0.0934 0.1023 0.1009 0.1033 0.0967 0.0894 0.0888
va: 2.2951 2.0006 5.4226 2.1003 2.0966 2.1058 2.0667 2.0447 3.1401 3.7992 4.1535 3.8356 3.8316 3.8638 4.2780 3.9230 3.9009 3.8239 3.9369 1.0156 1.0482 0.9871 1.0133 0.9914 1.0135 1.0191 0.9940 0.9965 1.0059 1.0081 1.0180 1.0177 1.0032 1.0110 1.0099 0.9963 1.0069 1.0130 1.0029
dispcorr: -0.021305596 hartree
energy: -1962.014164411574
dipole: 2.16021 -1.81447 0.34573 -2.10777 0.87260 -1.23517 -8.37249 7.49710 -0.87539
magnitude: 1.55290 au
magnitude: 3.94715 debye
