program: Orca
programVersion: 5.0.4
elementType: S S P O O O O O N C C C C C C C C C C H H H H H H H H H H H H H H H H H H H H
charge: 0
multiplicity: 1
keywords: wb97x-d3
keywords: def2-TZVPP
keywords: def2/J RIJCOSX
keywords: DEFGRID2
keywords: scfconv7
keywords: smallprint printgap noloewdin
keywords: NOSOSCF
formula: C10H20NO5PS2
InChI: InChI=1/C10H20NO5PS2/c1-5-14-10(13)11(4)9(12)8-19-17(18,15-6-2)16-7-3/h5-8H2,1-4H3
39 atoms
S  0.14975 -1.474928 0.247677
S  -2.643235 -0.389745 1.911959
P  -1.68589 -0.479938 0.241926
O  -1.292079 0.921995 -0.417944
O  -2.401904 -1.232467 -0.975123
O  3.547261 0.788362 -1.267364
O  0.750024 1.638633 2.111865
O  3.139394 -0.900842 0.138377
N  2.054277 1.118918 0.346623
C  0.905465 -0.672145 1.694429
C  1.247868 0.776018 1.424839
C  -2.072277 2.119818 -0.214292
C  -3.097622 -2.48421 -0.783665
C  2.027374 2.507963 -0.111846
C  2.93867 0.227193 -0.240499
C  -3.387643 2.086221 -0.951105
C  -4.58796 -2.267494 -0.755695
C  4.574886 0.040056 -1.941453
C  5.89434 0.107163 -1.21064
H  1.769518 -1.271301 1.969929
H  0.201735 -0.69554 2.525786
H  -1.438188 2.92363 -0.585286
H  -2.222786 2.275612 0.855537
H  -2.758779 -2.977628 0.130159
H  -2.805514 -3.113861 -1.6236
H  2.969642 3.013563 0.093337
H  1.239985 3.039155 0.40926
H  1.817292 2.552243 -1.17757
H  -4.062905 1.328401 -0.551991
H  -3.248166 1.904582 -2.016883
H  -3.879573 3.053352 -0.838422
H  -4.890084 -1.661396 0.097753
H  -5.086118 -3.234532 -0.672865
H  -4.939488 -1.788638 -1.669738
H  4.652431 0.515893 -2.917469
H  4.2501 -0.989242 -2.096568
H  5.858534 -0.38709 -0.240348
H  6.654359 -0.396205 -1.809612
H  6.216812 1.138587 -1.065617
elementType: S P O N C H
totalener: -1961.99442256 hartree
nucrepener: 2135.82840328 hartree
electener: -4097.82282583 hartree
oneelecener: -6950.12773358 hartree
twoeener: 2852.30490774 hartree
cpcmener: -0.02709598 hartree
kineticenergy: 1956.36020186 hartree
xcener: -132.532548421148 hartree
chargesum: 0.0000000
charge: -0.149972 -0.442937 0.626177 -0.341061 -0.356344 -0.298231 -0.418251 -0.475257 -0.111133 -0.050178 0.240291 0.038565 0.049831 -0.188548 0.509724 -0.234764 -0.245137 0.037497 -0.250454 0.154909 0.129971 0.107390 0.096112 0.088141 0.109639 0.135576 0.106548 0.123119 0.076690 0.092147 0.097803 0.077556 0.097541 0.091059 0.107430 0.093183 0.089962 0.096882 0.088526
qa: -0.1500 -0.4429 0.6262 -0.3411 -0.3563 -0.2982 -0.4183 -0.4753 -0.1111 -0.0502 0.2403 0.0386 0.0498 -0.1885 0.5097 -0.2348 -0.2451 0.0375 -0.2505 0.1549 0.1300 0.1074 0.0961 0.0881 0.1096 0.1356 0.1065 0.1231 0.0767 0.0921 0.0978 0.0776 0.0975 0.0911 0.1074 0.0932 0.0900 0.0969 0.0885
va: 2.3011 1.9963 5.4380 2.0948 2.0881 2.1377 2.0684 2.0125 3.1482 3.7869 4.1128 3.8299 3.8374 3.8683 4.2485 3.9313 3.9313 3.8532 3.9184 1.0181 1.0494 0.9873 1.0145 1.0103 0.9943 0.9955 1.0195 0.9955 1.0148 1.0057 1.0090 1.0177 1.0093 1.0025 0.9948 1.0103 1.0129 1.0068 1.0047
dispcorr: -0.020317986 hartree
energy: -1962.014740542773
dipole: 1.37355 -0.40528 0.96828 5.68153 -5.33685 0.34467 -12.22256 10.03698 -2.18558
magnitude: 2.41519 au
magnitude: 6.13892 debye
