program: Orca
programVersion: 5.0.4
elementType: S S P O O O O O N C C C C C C C C C C H H H H H H H H H H H H H H H H H H H H
charge: 0
multiplicity: 1
keywords: wb97x-d3
keywords: def2-TZVPP
keywords: def2/J RIJCOSX
keywords: DEFGRID2
keywords: scfconv7
keywords: smallprint printgap noloewdin
keywords: NOSOSCF
formula: C10H20NO5PS2
InChI: InChI=1/C10H20NO5PS2/c1-5-14-10(13)11(4)9(12)8-19-17(18,15-6-2)16-7-3/h5-8H2,1-4H3
39 atoms
S  -1.090003 -0.421104 -1.865013
S  -0.939341 -0.787646 1.518126
P  -2.035931 -0.340885 -0.006412
O  -2.708745 1.102975 -0.02153
O  -3.328425 -1.261848 -0.234926
O  4.160726 0.304702 0.813268
O  0.246989 1.877184 -0.676736
O  3.291772 -0.705918 -0.982429
N  2.177644 0.999087 0.082902
C  0.652618 -0.357242 -1.371135
C  1.001019 0.93467 -0.653869
C  -3.312684 1.658905 1.169814
C  -3.238511 -2.698616 -0.224268
C  2.328523 2.093046 1.04335
C  3.228568 0.11478 -0.099903
C  -2.406327 2.691653 1.789568
C  -4.592808 -3.261059 0.120598
C  5.374874 -0.463711 0.719057
C  6.338526 0.12269 -0.284305
H  1.206623 -0.434641 -2.308154
H  0.888464 -1.23637 -0.776835
H  -3.556555 0.871283 1.886639
H  -4.251376 2.104151 0.840808
H  -2.492566 -3.019611 0.507001
H  -2.910519 -3.036719 -1.209717
H  2.497879 1.700894 2.043606
H  1.41768 2.678806 1.061194
H  3.150285 2.751281 0.767168
H  -2.917999 3.152204 2.63593
H  -2.155627 3.481537 1.080979
H  -1.483328 2.244578 2.158535
H  -4.540694 -4.350196 0.103551
H  -5.353929 -2.952643 -0.596619
H  -4.908618 -2.957083 1.118968
H  5.14348 -1.505697 0.496211
H  5.792161 -0.422276 1.723544
H  7.276695 -0.431738 -0.237345
H  5.966669 0.056592 -1.306368
H  6.559644 1.166577 -0.059699
elementType: S P O N C H
totalener: -1961.99511076 hartree
nucrepener: 2095.12901768 hartree
electener: -4057.12412844 hartree
oneelecener: -6869.24514571 hartree
twoeener: 2812.12101726 hartree
cpcmener: -0.02778991 hartree
kineticenergy: 1956.35487029 hartree
xcener: -132.530896667034 hartree
chargesum: 0.0000000
charge: -0.144719 -0.458359 0.675843 -0.342124 -0.353398 -0.297780 -0.413041 -0.476400 -0.110815 -0.063566 0.240423 0.043562 0.035525 -0.176360 0.509769 -0.243643 -0.240543 0.037973 -0.249710 0.156596 0.132353 0.087792 0.105739 0.089593 0.096088 0.118630 0.109962 0.130099 0.098864 0.091452 0.073231 0.087318 0.088190 0.085505 0.092428 0.107802 0.097019 0.090351 0.088354
qa: -0.1447 -0.4584 0.6758 -0.3421 -0.3534 -0.2978 -0.4130 -0.4764 -0.1108 -0.0636 0.2404 0.0436 0.0355 -0.1764 0.5098 -0.2436 -0.2405 0.0380 -0.2497 0.1566 0.1324 0.0878 0.1057 0.0896 0.0961 0.1186 0.1100 0.1301 0.0989 0.0915 0.0732 0.0873 0.0882 0.0855 0.0924 0.1078 0.0970 0.0904 0.0884
va: 2.2945 1.9838 5.3776 2.1027 2.1075 2.1344 2.0718 2.0210 3.1729 3.8174 4.1567 3.8669 3.8542 3.8644 4.2482 3.9159 3.9604 3.8513 3.9180 1.0134 1.0371 1.0088 0.9957 1.0064 0.9970 0.9966 1.0182 0.9956 1.0110 1.0039 1.0164 1.0065 1.0037 1.0067 1.0103 0.9949 1.0070 1.0126 1.0046
dispcorr: -0.018923013 hartree
energy: -1962.014033774632
dipole: 6.97357 -5.80410 1.16947 0.47061 -0.86347 -0.39286 8.84042 -7.91587 0.92455
magnitude: 1.54168 au
magnitude: 3.91865 debye
