program: Orca
programVersion: 5.0.4
elementType: S S P O O O O O N C C C C C C C C C C H H H H H H H H H H H H H H H H H H H H
charge: 0
multiplicity: 1
keywords: wb97x-d3
keywords: def2-TZVPP
keywords: def2/J RIJCOSX
keywords: DEFGRID2
keywords: scfconv7
keywords: smallprint printgap noloewdin
keywords: NOSOSCF
formula: C10H20NO5PS2
InChI: InChI=1/C10H20NO5PS2/c1-5-14-10(13)11(4)9(12)8-19-17(18,15-6-2)16-7-3/h5-8H2,1-4H3
39 atoms
S  -1.045519 -0.152944 -1.941692
S  -0.851979 -0.99866 1.364725
P  -1.989059 -0.461211 -0.100559
O  -2.902356 0.823262 0.16901
O  -3.086961 -1.510205 -0.603943
O  4.40698 0.456776 0.452662
O  0.310301 1.966988 -0.479936
O  3.316235 -0.625417 -1.164266
N  2.303154 1.05912 0.036485
C  0.694949 -0.169046 -1.447876
C  1.074096 1.04039 -0.614298
C  -2.589835 1.890383 1.080903
C  -4.100366 -1.992366 0.30555
C  2.52724 2.112571 1.028354
C  3.349805 0.212004 -0.295709
C  -3.723663 2.055206 2.060298
C  -4.774789 -3.18258 -0.323758
C  5.590024 -0.3271 0.209369
C  6.632845 0.104177 1.20719
H  1.244552 -0.169129 -2.390352
H  0.920961 -1.103923 -0.941091
H  -2.447505 2.792162 0.485209
H  -1.65767 1.680737 1.607765
H  -4.819522 -1.193736 0.49823
H  -3.637433 -2.269825 1.255879
H  3.179616 2.893633 0.640231
H  2.962528 1.693263 1.930738
H  1.577189 2.560176 1.294179
H  -3.844907 1.166303 2.680782
H  -4.66836 2.260723 1.555724
H  -3.508332 2.897074 2.719606
H  -4.073216 -3.999714 -0.492656
H  -5.247575 -2.924161 -1.27155
H  -5.553181 -3.544855 0.348678
H  5.932024 -0.159543 -0.813662
H  5.355967 -1.387066 0.32275
H  6.883956 1.159822 1.101008
H  6.31073 -0.077634 2.232832
H  7.542336 -0.47224 1.037321
elementType: S P O N C H
totalener: -1961.99670831 hartree
nucrepener: 2067.28783584 hartree
electener: -4029.28454415 hartree
oneelecener: -6813.32422737 hartree
twoeener: 2784.03968323 hartree
cpcmener: -0.02626463 hartree
kineticenergy: 1956.33906162 hartree
xcener: -132.526904827523 hartree
chargesum: 0.0000000
charge: -0.148568 -0.456740 0.655412 -0.341467 -0.344949 -0.294657 -0.423115 -0.474846 -0.117399 -0.067789 0.262774 0.060014 0.027157 -0.178960 0.516308 -0.242992 -0.241792 0.032236 -0.247925 0.158924 0.132059 0.102074 0.077780 0.105255 0.092737 0.130451 0.118238 0.111140 0.081152 0.090366 0.093897 0.087975 0.088878 0.085961 0.102279 0.099638 0.089077 0.089281 0.090136
qa: -0.1486 -0.4567 0.6554 -0.3415 -0.3449 -0.2947 -0.4231 -0.4748 -0.1174 -0.0678 0.2628 0.0600 0.0272 -0.1790 0.5163 -0.2430 -0.2418 0.0322 -0.2479 0.1589 0.1321 0.1021 0.0778 0.1053 0.0927 0.1305 0.1182 0.1111 0.0812 0.0904 0.0939 0.0880 0.0889 0.0860 0.1023 0.0996 0.0891 0.0893 0.0901
va: 2.2888 1.9863 5.3932 2.0903 2.1293 2.1348 2.0568 2.0268 3.1961 3.8124 4.1296 3.8342 3.8603 3.8713 4.2370 3.9404 3.9635 3.8479 3.9680 1.0127 1.0399 0.9956 1.0136 0.9940 1.0007 0.9931 0.9989 1.0153 1.0088 1.0043 1.0092 1.0052 1.0035 1.0067 0.9960 0.9964 1.0032 1.0030 1.0068
dispcorr: -0.018269972 hartree
energy: -1962.014978279101
dipole: 4.10992 -2.99674 1.11318 1.93184 -1.43500 0.49685 12.74074 -11.57515 1.16559
magnitude: 1.68660 au
magnitude: 4.28698 debye
