program: Orca
programVersion: 5.0.4
elementType: S S P O O O O O N C C C C C C C C C C H H H H H H H H H H H H H H H H H H H H
charge: 0
multiplicity: 1
keywords: wb97x-d3
keywords: def2-TZVPP
keywords: def2/J RIJCOSX
keywords: DEFGRID2
keywords: scfconv7
keywords: smallprint printgap noloewdin
keywords: NOSOSCF
formula: C10H20NO5PS2
InChI: InChI=1/C10H20NO5PS2/c1-5-14-10(13)11(4)9(12)8-19-17(18,15-6-2)16-7-3/h5-8H2,1-4H3
39 atoms
S  -1.261858 -0.257256 -1.716109
S  -0.882234 -0.935168 1.597504
P  -2.107482 -0.424594 0.198329
O  -2.961995 0.899357 0.419718
O  -3.343159 -1.403966 -0.084037
O  4.306536 0.383638 0.353831
O  0.186409 1.917291 -0.439364
O  3.158147 -0.680349 -1.237207
N  2.208592 1.026532 -0.015743
C  0.508299 -0.255676 -1.341904
C  0.940638 0.985048 -0.583774
C  -2.646492 1.93576 1.370594
C  -3.117684 -2.795867 -0.381609
C  2.495466 2.099659 0.938734
C  3.229153 0.156916 -0.370725
C  -2.903096 3.278396 0.736125
C  -4.429072 -3.528615 -0.273716
C  5.482004 -0.396945 0.064611
C  6.571694 0.059939 0.999183
H  0.99382 -0.291916 -2.318876
H  0.770665 -1.169649 -0.814597
H  -1.611651 1.850122 1.703665
H  -3.28632 1.784681 2.241518
H  -2.38843 -3.208379 0.31982
H  -2.703072 -2.884551 -1.38811
H  1.585308 2.652213 1.136729
H  3.236864 2.793603 0.544468
H  2.850246 1.685743 1.880243
H  -2.252795 3.450956 -0.121536
H  -2.704361 4.060264 1.470041
H  -3.939989 3.381815 0.414045
H  -5.168771 -3.140948 -0.974686
H  -4.838637 -3.474927 0.735149
H  -4.26476 -4.580206 -0.511431
H  5.771879 -0.245545 -0.976748
H  5.261148 -1.455908 0.208885
H  7.475064 -0.514568 0.793385
H  6.810279 1.114625 0.858643
H  6.305357 -0.102776 2.043871
elementType: S P O N C H
totalener: -1961.99622712 hartree
nucrepener: 2076.22902512 hartree
electener: -4038.22525223 hartree
oneelecener: -6831.14154998 hartree
twoeener: 2792.91629775 hartree
cpcmener: -0.02591848 hartree
kineticenergy: 1956.33679831 hartree
xcener: -132.528155461574 hartree
chargesum: -0.0000000
charge: -0.162342 -0.453670 0.668040 -0.342891 -0.348683 -0.294358 -0.426308 -0.474801 -0.115090 -0.058397 0.264956 0.041985 0.032608 -0.177400 0.514582 -0.236866 -0.242917 0.032758 -0.248330 0.156278 0.131558 0.082369 0.113377 0.093891 0.096936 0.112283 0.127799 0.119065 0.081051 0.087559 0.091318 0.088553 0.087485 0.086543 0.101445 0.100799 0.090231 0.088995 0.089590
qa: -0.1623 -0.4537 0.6680 -0.3429 -0.3487 -0.2944 -0.4263 -0.4748 -0.1151 -0.0584 0.2650 0.0420 0.0326 -0.1774 0.5146 -0.2369 -0.2429 0.0328 -0.2483 0.1563 0.1316 0.0824 0.1134 0.0939 0.0969 0.1123 0.1278 0.1191 0.0811 0.0876 0.0913 0.0886 0.0875 0.0865 0.1014 0.1008 0.0902 0.0890 0.0896
va: 2.2832 1.9914 5.3924 2.1127 2.1185 2.1343 2.0532 2.0277 3.1959 3.8166 4.1217 3.8372 3.8508 3.8649 4.2384 3.9442 3.9689 3.8465 3.9686 1.0125 1.0375 1.0087 0.9950 1.0007 1.0004 1.0188 0.9949 0.9968 1.0157 1.0072 1.0035 1.0035 1.0058 1.0057 0.9965 0.9958 1.0068 1.0031 1.0030
dispcorr: -0.018265402 hartree
energy: -1962.014492518709
dipole: 9.38744 -7.47118 1.91626 1.97821 -1.99015 -0.01194 6.19891 -5.81767 0.38125
magnitude: 1.95385 au
magnitude: 4.96629 debye
