program: Orca
programVersion: 5.0.4
elementType: S S P O O O O O N C C C C C C C C C C H H H H H H H H H H H H H H H H H H H H
charge: 0
multiplicity: 1
keywords: wb97x-d3
keywords: def2-TZVPP
keywords: def2/J RIJCOSX
keywords: DEFGRID2
keywords: scfconv7
keywords: smallprint printgap noloewdin
keywords: NOSOSCF
formula: C10H20NO5PS2
InChI: InChI=1/C10H20NO5PS2/c1-5-14-10(13)11(4)9(12)8-19-17(18,15-6-2)16-7-3/h5-8H2,1-4H3
39 atoms
S  0.004587 -1.432717 0.138372
S  -2.765819 -0.3122 1.830491
P  -1.778556 -0.349069 0.175895
O  -1.282724 1.068211 -0.378937
O  -2.521393 -0.978116 -1.093057
O  3.505831 0.756457 -1.273567
O  0.759011 1.567794 2.155453
O  3.000578 -0.985759 0.033093
N  2.024744 1.074813 0.353212
C  0.792343 -0.721296 1.616083
C  1.204496 0.718897 1.417625
C  -2.01829 2.284452 -0.131053
C  -3.560657 -1.970323 -0.980897
C  2.068908 2.484995 -0.034058
C  2.862126 0.170793 -0.28162
C  -3.332748 2.332237 -0.872152
C  -3.022983 -3.336346 -0.631832
C  4.510123 -0.001846 -1.970708
C  5.816823 -0.03607 -1.213869
H  1.627494 -1.370859 1.866179
H  0.087614 -0.750626 2.446624
H  -1.352908 3.078832 -0.466452
H  -2.168187 2.40275 0.944094
H  -4.040311 -1.979015 -1.958485
H  -4.299364 -1.640273 -0.247649
H  1.839085 2.595791 -1.091139
H  3.043215 2.924741 0.173145
H  1.325529 3.032858 0.532369
H  -3.197862 2.18136 -1.943491
H  -3.784406 3.314446 -0.726871
H  -4.041227 1.590909 -0.500198
H  -2.590547 -3.364337 0.369014
H  -2.271075 -3.669305 -1.347912
H  -3.844153 -4.054047 -0.653363
H  4.628302 0.521214 -2.918064
H  4.141607 -1.005066 -2.18662
H  6.565737 -0.541679 -1.824737
H  6.182498 0.969874 -1.005859
H  5.737224 -0.579846 -0.272904
elementType: S P O N C H
totalener: -1961.99435651 hartree
nucrepener: 2144.97651773 hartree
electener: -4106.97087423 hartree
oneelecener: -6968.46100178 hartree
twoeener: 2861.49012754 hartree
cpcmener: -0.02687580 hartree
kineticenergy: 1956.36236034 hartree
xcener: -132.534146032769 hartree
chargesum: 0.0000000
charge: -0.145437 -0.444746 0.630913 -0.342927 -0.357781 -0.298819 -0.418128 -0.474908 -0.110098 -0.046259 0.234128 0.034678 0.048951 -0.190069 0.509644 -0.237494 -0.252322 0.038357 -0.251104 0.155288 0.128990 0.106523 0.096907 0.109102 0.092374 0.123684 0.135202 0.107380 0.091722 0.097741 0.078533 0.079184 0.093272 0.101704 0.107083 0.093135 0.096883 0.088664 0.090053
qa: -0.1454 -0.4447 0.6309 -0.3429 -0.3578 -0.2988 -0.4181 -0.4749 -0.1101 -0.0463 0.2341 0.0347 0.0490 -0.1901 0.5096 -0.2375 -0.2523 0.0384 -0.2511 0.1553 0.1290 0.1065 0.0969 0.1091 0.0924 0.1237 0.1352 0.1074 0.0917 0.0977 0.0785 0.0792 0.0933 0.1017 0.1071 0.0931 0.0969 0.0887 0.0901
va: 2.2977 1.9960 5.4198 2.0963 2.0932 2.1367 2.0688 2.0129 3.1442 3.7892 4.1229 3.8358 3.8334 3.8678 4.2488 3.9242 3.9028 3.8524 3.9182 1.0174 1.0491 0.9874 1.0140 0.9914 1.0143 0.9949 0.9960 1.0196 1.0061 1.0082 1.0181 1.0180 1.0032 1.0113 0.9949 1.0103 1.0069 1.0047 1.0129
dispcorr: -0.020483762 hartree
energy: -1962.014840269168
dipole: 4.68275 -3.77726 0.90549 3.93127 -3.46269 0.46858 -11.27056 9.10990 -2.16066
magnitude: 2.38913 au
magnitude: 6.07268 debye
