program: Orca
programVersion: 5.0.4
elementType: S S P O O O O O N C C C C C C C C C C H H H H H H H H H H H H H H H H H H H H
charge: 0
multiplicity: 1
keywords: wb97x-d3
keywords: def2-TZVPP
keywords: def2/J RIJCOSX
keywords: DEFGRID2
keywords: scfconv7
keywords: smallprint printgap noloewdin
keywords: NOSOSCF
formula: C10H20NO5PS2
InChI: InChI=1/C10H20NO5PS2/c1-5-14-10(13)11(4)9(12)8-19-17(18,15-6-2)16-7-3/h5-8H2,1-4H3
39 atoms
S  -1.29352 -0.06471 -1.569968
S  -0.598905 -1.180791 1.566742
P  -1.935026 -0.450182 0.393043
O  -2.575548 0.884639 0.973112
O  -3.252357 -1.322623 0.126994
O  4.311276 0.271555 0.334353
O  0.206534 1.992838 -0.14036
O  3.164862 -0.38828 -1.463463
N  2.251896 1.071494 0.064147
C  0.505009 -0.026581 -1.354024
C  0.961376 1.102597 -0.449943
C  -3.607989 1.62262 0.284367
C  -3.176326 -2.673317 -0.364131
C  2.583183 1.99299 1.152491
C  3.247391 0.249654 -0.442352
C  -3.329344 3.096145 0.420455
C  -4.454492 -3.381119 0.001925
C  5.453773 -0.502022 -0.075149
C  6.532345 -0.297836 0.95586
H  0.898982 0.10988 -2.361918
H  0.838142 -0.998721 -1.000669
H  -4.563579 1.354197 0.736259
H  -3.650487 1.34467 -0.771853
H  -2.313844 -3.179428 0.076962
H  -3.035365 -2.648164 -1.446619
H  3.355382 2.695856 0.848315
H  2.916941 1.444598 2.029239
H  1.69862 2.555791 1.422881
H  -2.391594 3.369072 -0.062224
H  -3.289078 3.403703 1.465248
H  -4.130084 3.656687 -0.061817
H  -5.325553 -2.882768 -0.423784
H  -4.581023 -3.442555 1.082972
H  -4.426174 -4.397284 -0.391121
H  5.785375 -0.1701 -1.060266
H  5.173948 -1.55425 -0.144893
H  6.221239 -0.646194 1.940097
H  7.412779 -0.86958 0.663478
H  6.82649 0.748374 1.032015
elementType: S P O N C H
totalener: -1961.99745672 hartree
nucrepener: 2079.36438559 hartree
electener: -4041.36184231 hartree
oneelecener: -6837.64303154 hartree
twoeener: 2796.28118923 hartree
cpcmener: -0.02866789 hartree
kineticenergy: 1956.36314772 hartree
xcener: -132.532133070350 hartree
chargesum: -0.0000000
charge: -0.175414 -0.437642 0.646773 -0.336292 -0.336307 -0.293443 -0.424159 -0.472187 -0.113291 -0.050396 0.257476 0.024239 0.035704 -0.176095 0.510477 -0.232339 -0.240305 0.036907 -0.249190 0.156324 0.131600 0.105582 0.090255 0.090291 0.097773 0.128575 0.117156 0.113512 0.081604 0.090686 0.091025 0.087719 0.087501 0.086906 0.099729 0.100637 0.089170 0.090617 0.088823
qa: -0.1754 -0.4376 0.6468 -0.3363 -0.3363 -0.2934 -0.4242 -0.4722 -0.1133 -0.0504 0.2575 0.0242 0.0357 -0.1761 0.5105 -0.2323 -0.2403 0.0369 -0.2492 0.1563 0.1316 0.1056 0.0903 0.0903 0.0978 0.1286 0.1172 0.1135 0.0816 0.0907 0.0910 0.0877 0.0875 0.0869 0.0997 0.1006 0.0892 0.0906 0.0888
va: 2.2635 2.0223 5.4202 2.1110 2.0950 2.1337 2.0540 2.0301 3.1880 3.8094 4.1291 3.8812 3.8511 3.8561 4.2437 3.9400 3.9707 3.8441 3.9690 1.0125 1.0374 0.9958 0.9942 1.0041 0.9968 0.9949 0.9973 1.0242 1.0150 1.0043 1.0079 1.0036 1.0060 1.0066 0.9972 0.9959 1.0031 1.0069 1.0032
dispcorr: -0.018179556 hartree
energy: -1962.015636272056
dipole: 4.99570 -4.14066 0.85504 0.46110 -0.67630 -0.21520 2.16080 -2.87612 -0.71531
magnitude: 1.13538 au
magnitude: 2.88590 debye
