program: Orca
programVersion: 5.0.4
elementType: S S P O O O O O N C C C C C C C C C C H H H H H H H H H H H H H H H H H H H H
charge: 0
multiplicity: 1
keywords: wb97x-d3
keywords: def2-TZVPP
keywords: def2/J RIJCOSX
keywords: DEFGRID2
keywords: scfconv7
keywords: smallprint printgap noloewdin
keywords: NOSOSCF
formula: C10H20NO5PS2
InChI: InChI=1/C10H20NO5PS2/c1-5-14-10(13)11(4)9(12)8-19-17(18,15-6-2)16-7-3/h5-8H2,1-4H3
39 atoms
S  -1.127206 0.267631 -1.854197
S  -0.850473 -0.980675 1.325588
P  -2.029292 -0.474827 -0.115307
O  -3.14488 0.618445 0.239745
O  -2.94186 -1.625428 -0.739888
O  4.388895 0.311299 0.480454
O  0.398504 2.150476 -0.234804
O  3.241637 -0.495291 -1.255343
N  2.308405 1.043377 0.180294
C  0.62826 0.109366 -1.437105
C  1.086407 1.18603 -0.469659
C  -2.81766 1.850192 0.910837
C  -3.547781 -2.660829 0.062295
C  2.57346 1.94673 1.300987
C  3.316893 0.212005 -0.279786
C  -3.991957 2.260872 1.760496
C  -4.63039 -2.158129 0.985147
C  5.541117 -0.473426 0.123346
C  6.610009 -0.195305 1.147959
H  1.147718 0.216711 -2.390947
H  0.831624 -0.893089 -1.071232
H  -2.593395 2.602635 0.153989
H  -1.929265 1.71517 1.530987
H  -2.767907 -3.181145 0.621365
H  -3.957822 -3.358441 -0.665726
H  3.18996 2.791568 0.998542
H  3.065844 1.411246 2.105256
H  1.633927 2.326223 1.683718
H  -4.193956 1.528842 2.541812
H  -4.895317 2.396919 1.166101
H  -3.766566 3.211011 2.244428
H  -4.235744 -1.545818 1.795311
H  -5.123915 -3.018666 1.438922
H  -5.387009 -1.58647 0.44811
H  5.875573 -0.195107 -0.877799
H  5.274464 -1.531669 0.113362
H  6.902118 0.854952 1.153182
H  6.289002 -0.473667 2.152054
H  7.494152 -0.785106 0.906109
elementType: S P O N C H
totalener: -1961.99566172 hartree
nucrepener: 2075.12951893 hartree
electener: -4037.12518064 hartree
oneelecener: -6828.99313498 hartree
twoeener: 2791.86795434 hartree
cpcmener: -0.02590001 hartree
kineticenergy: 1956.35638741 hartree
xcener: -132.530710930384 hartree
chargesum: -0.0000000
charge: -0.152109 -0.452962 0.659157 -0.337135 -0.350289 -0.294975 -0.420550 -0.476396 -0.117319 -0.060431 0.259327 0.052281 0.021073 -0.179935 0.516357 -0.246335 -0.234652 0.034231 -0.248640 0.157951 0.130014 0.098229 0.081621 0.092912 0.107839 0.131717 0.117819 0.109147 0.085846 0.090422 0.091626 0.076143 0.099038 0.090321 0.100758 0.099650 0.089019 0.088752 0.090480
qa: -0.1521 -0.4530 0.6592 -0.3371 -0.3503 -0.2950 -0.4206 -0.4764 -0.1173 -0.0604 0.2593 0.0523 0.0211 -0.1799 0.5164 -0.2463 -0.2347 0.0342 -0.2486 0.1580 0.1300 0.0982 0.0816 0.0929 0.1078 0.1317 0.1178 0.1091 0.0858 0.0904 0.0916 0.0761 0.0990 0.0903 0.1008 0.0997 0.0890 0.0888 0.0905
va: 2.2790 1.9930 5.3807 2.0949 2.1229 2.1346 2.0598 2.0256 3.1871 3.8080 4.1333 3.8390 3.8837 3.8781 4.2402 3.9578 3.8862 3.8486 3.9679 1.0134 1.0397 0.9992 1.0059 1.0076 0.9898 0.9922 1.0006 1.0118 1.0053 1.0037 1.0077 1.0176 1.0093 1.0070 0.9963 0.9961 1.0031 1.0031 1.0070
dispcorr: -0.018733548 hartree
energy: -1962.014395266618
dipole: 4.73570 -3.50292 1.23278 1.71857 -1.75472 -0.03615 13.88531 -12.89749 0.98782
magnitude: 1.58014 au
magnitude: 4.01640 debye
