program: Orca
programVersion: 5.0.4
elementType: S S P O O O O O N C C C C C C C C C C H H H H H H H H H H H H H H H H H H H H
charge: 0
multiplicity: 1
keywords: wb97x-d3
keywords: def2-TZVPP
keywords: def2/J RIJCOSX
keywords: DEFGRID2
keywords: scfconv7
keywords: smallprint printgap noloewdin
keywords: NOSOSCF
formula: C10H20NO5PS2
InChI: InChI=1/C10H20NO5PS2/c1-5-14-10(13)11(4)9(12)8-19-17(18,15-6-2)16-7-3/h5-8H2,1-4H3
39 atoms
S  -1.133212 0.20006 -1.941056
S  -0.798641 -1.064418 1.221907
P  -2.009992 -0.510403 -0.173735
O  -3.081489 0.608547 0.232477
O  -2.984245 -1.62042 -0.778489
O  4.292358 0.261854 0.530231
O  0.333983 2.135891 -0.324859
O  3.274034 -0.398989 -1.34438
N  2.263996 1.068896 0.114379
C  0.627938 0.10441 -1.525959
C  1.050062 1.190678 -0.552338
C  -2.721659 1.801194 0.954463
C  -3.566309 -2.663655 0.031485
C  2.503334 1.950647 1.258645
C  3.285201 0.238959 -0.319242
C  -3.876656 2.194523 1.838877
C  -4.546455 -2.158021 1.062156
C  5.471701 -0.493117 0.198631
C  6.471966 -0.270751 1.303294
H  1.13994 0.238122 -2.480725
H  0.867037 -0.89358 -1.168587
H  -2.493867 2.585454 0.230339
H  -1.827734 1.621774 1.556269
H  -2.764328 -3.236552 0.501976
H  -4.064012 -3.314476 -0.685762
H  2.822498 1.373188 2.122552
H  1.580767 2.456659 1.51662
H  3.254974 2.704795 1.02803
H  -4.783514 2.382353 1.261394
H  -3.621264 3.114369 2.367914
H  -4.088208 1.426987 2.585632
H  -5.033772 -3.016688 1.525881
H  -5.322552 -1.537384 0.61447
H  -4.059047 -1.593227 1.856835
H  5.865646 -0.152436 -0.760805
H  5.215726 -1.550265 0.108105
H  7.380863 -0.827945 1.075538
H  6.742018 0.781603 1.39741
H  6.097916 -0.622986 2.265084
elementType: S P O N C H
totalener: -1961.99513093 hartree
nucrepener: 2081.09758426 hartree
electener: -4043.09271520 hartree
oneelecener: -6840.89936424 hartree
twoeener: 2797.80664905 hartree
cpcmener: -0.02555704 hartree
kineticenergy: 1956.33556891 hartree
xcener: -132.526925248733 hartree
chargesum: -0.0000000
charge: -0.151803 -0.452444 0.659597 -0.335277 -0.352551 -0.295116 -0.419765 -0.475044 -0.113393 -0.066153 0.255369 0.054970 0.021618 -0.179296 0.514168 -0.246388 -0.235924 0.035241 -0.249430 0.157550 0.130533 0.097781 0.080295 0.093859 0.108504 0.117896 0.111769 0.130282 0.090414 0.091896 0.085667 0.099500 0.090814 0.075048 0.100176 0.100949 0.090402 0.089017 0.089268
qa: -0.1518 -0.4524 0.6596 -0.3353 -0.3526 -0.2951 -0.4198 -0.4750 -0.1134 -0.0662 0.2554 0.0550 0.0216 -0.1793 0.5142 -0.2464 -0.2359 0.0352 -0.2494 0.1576 0.1305 0.0978 0.0803 0.0939 0.1085 0.1179 0.1118 0.1303 0.0904 0.0919 0.0857 0.0995 0.0908 0.0750 0.1002 0.1009 0.0904 0.0890 0.0893
va: 2.2800 1.9921 5.3779 2.0953 2.1207 2.1333 2.0632 2.0274 3.1804 3.8081 4.1366 3.8344 3.8811 3.8665 4.2426 3.9546 3.8848 3.8467 3.9683 1.0133 1.0396 0.9996 1.0072 1.0068 0.9898 0.9978 1.0179 0.9938 1.0036 1.0077 1.0051 1.0094 1.0071 1.0183 0.9969 0.9954 1.0070 1.0031 1.0029
dispcorr: -0.018960166 hartree
energy: -1962.014091099898
dipole: 4.82465 -3.60232 1.22233 1.67197 -1.70833 -0.03637 15.24683 -14.09523 1.15160
magnitude: 1.67976 au
magnitude: 4.26962 debye
