program: Orca
programVersion: 5.0.4
elementType: S S P O O O O O N C C C C C C C C C C H H H H H H H H H H H H H H H H H H H H
charge: 0
multiplicity: 1
keywords: wb97x-d3
keywords: def2-TZVPP
keywords: def2/J RIJCOSX
keywords: DEFGRID2
keywords: scfconv7
keywords: smallprint printgap noloewdin
keywords: NOSOSCF
formula: C10H20NO5PS2
InChI: InChI=1/C10H20NO5PS2/c1-5-14-10(13)11(4)9(12)8-19-17(18,15-6-2)16-7-3/h5-8H2,1-4H3
39 atoms
S  -1.179206 -0.086239 -1.989911
S  -0.881442 -0.899453 1.284073
P  -2.055515 -0.226884 -0.09186
O  -2.727798 1.194868 0.159722
O  -3.380496 -1.059872 -0.426056
O  4.239754 0.254314 0.444147
O  0.269342 2.030179 -0.608264
O  3.180757 -0.684878 -1.279852
N  2.239991 1.060792 -0.105315
C  0.580777 -0.121455 -1.566087
C  1.00494 1.080585 -0.742972
C  -2.550178 1.968089 1.361585
C  -3.316207 -2.4612 -0.759569
C  2.524407 2.11018 0.875892
C  3.226234 0.126996 -0.388008
C  -3.577889 1.604841 2.403081
C  -3.669256 -3.316943 0.43097
C  5.370707 -0.616192 0.257885
C  6.392278 -0.260516 1.306391
H  1.099428 -0.126033 -2.526189
H  0.804943 -1.061243 -1.068801
H  -2.654578 3.006283 1.04883
H  -1.538182 1.836269 1.747864
H  -2.327691 -2.720276 -1.147842
H  -4.030001 -2.602668 -1.570831
H  1.646328 2.732937 0.993658
H  3.348784 2.741014 0.548229
H  2.763455 1.67486 1.843295
H  -4.593373 1.731262 2.026853
H  -3.458056 2.258828 3.268056
H  -3.457929 0.576306 2.744816
H  -3.684137 -4.363746 0.124516
H  -4.656143 -3.070134 0.823389
H  -2.937719 -3.211745 1.231733
H  5.775303 -0.478447 -0.746505
H  5.051014 -1.654945 0.358738
H  6.728596 0.77212 1.209461
H  6.005714 -0.409317 2.314982
H  7.262115 -0.90604 1.184977
elementType: S P O N C H
totalener: -1961.99498185 hartree
nucrepener: 2094.02540245 hartree
electener: -4056.02038431 hartree
oneelecener: -6866.83688834 hartree
twoeener: 2810.81650403 hartree
cpcmener: -0.02679847 hartree
kineticenergy: 1956.35361998 hartree
xcener: -132.533121869020 hartree
chargesum: 0.0000000
charge: -0.158037 -0.452783 0.672009 -0.348600 -0.358641 -0.293479 -0.423095 -0.472761 -0.114395 -0.058896 0.253944 0.054060 0.044931 -0.175927 0.512079 -0.240622 -0.243152 0.034097 -0.248642 0.156845 0.130927 0.109968 0.082104 0.081079 0.108362 0.111921 0.128283 0.118465 0.090192 0.093513 0.077146 0.092696 0.090253 0.075908 0.100747 0.100735 0.088898 0.089324 0.090545
qa: -0.1580 -0.4528 0.6720 -0.3486 -0.3586 -0.2935 -0.4231 -0.4728 -0.1144 -0.0589 0.2539 0.0541 0.0449 -0.1759 0.5121 -0.2406 -0.2432 0.0341 -0.2486 0.1568 0.1309 0.1100 0.0821 0.0811 0.1084 0.1119 0.1283 0.1185 0.0902 0.0935 0.0771 0.0927 0.0903 0.0759 0.1007 0.1007 0.0889 0.0893 0.0905
va: 2.2886 1.9854 5.3815 2.1001 2.0947 2.1335 2.0616 2.0288 3.1929 3.8096 4.1462 3.8435 3.8728 3.8588 4.2413 3.9343 3.9391 3.8459 3.9688 1.0122 1.0391 0.9914 1.0119 1.0106 0.9919 1.0224 0.9952 0.9971 1.0058 1.0080 1.0169 1.0081 1.0034 1.0203 0.9968 0.9958 1.0031 1.0030 1.0067
dispcorr: -0.018664384 hartree
energy: -1962.013646237750
dipole: 8.30942 -6.64068 1.66874 -2.92113 2.62541 -0.29572 13.68213 -12.89532 0.78681
magnitude: 1.86847 au
magnitude: 4.74928 debye
