program: Orca
programVersion: 5.0.4
elementType: S S P O O O O O N C C C C C C C C C C H H H H H H H H H H H H H H H H H H H H
charge: 0
multiplicity: 1
keywords: wb97x-d3
keywords: def2-TZVPP
keywords: def2/J RIJCOSX
keywords: DEFGRID2
keywords: scfconv7
keywords: smallprint printgap noloewdin
keywords: NOSOSCF
formula: C10H20NO5PS2
InChI: InChI=1/C10H20NO5PS2/c1-5-14-10(13)11(4)9(12)8-19-17(18,15-6-2)16-7-3/h5-8H2,1-4H3
39 atoms
S  -1.24709 -0.094601 -1.625045
S  -0.309168 -1.059114 1.495695
P  -1.757555 -0.455071 0.381733
O  -2.441319 0.857878 0.961271
O  -3.027051 -1.417525 0.216599
O  4.18541 0.512948 0.478002
O  0.140906 2.193869 -0.434297
O  3.243945 -0.125038 -1.449571
N  2.178449 1.325196 -0.022623
C  0.549541 0.099508 -1.476601
C  0.928464 1.298308 -0.625011
C  -3.549728 1.522043 0.315923
C  -2.873798 -2.775543 -0.242228
C  2.396923 2.266338 1.076929
C  3.217736 0.497736 -0.416138
C  -3.37829 3.011198 0.463961
C  -4.103822 -3.552884 0.145385
C  5.352336 -0.294443 0.238742
C  5.134202 -1.729196 0.655296
H  0.903154 0.241554 -2.500391
H  0.968367 -0.832801 -1.109926
H  -4.467882 1.178153 0.793757
H  -3.603415 1.25331 -0.7421
H  -1.980721 -3.216421 0.207506
H  -2.73772 -2.770659 -1.325587
H  1.50826 2.871336 1.207477
H  3.231124 2.931177 0.862387
H  2.585524 1.733658 2.006842
H  -3.314132 3.308107 1.510998
H  -4.242682 3.513183 0.028278
H  -2.488094 3.364653 -0.055713
H  -5.004883 -3.132473 -0.301791
H  -4.231555 -3.586887 1.227486
H  -4.001465 -4.577925 -0.212002
H  6.127137 0.169241 0.846689
H  5.656488 -0.217929 -0.805822
H  6.069308 -2.277687 0.535022
H  4.841657 -1.798522 1.703511
H  4.378281 -2.227035 0.048355
elementType: S P O N C H
totalener: -1961.99596902 hartree
nucrepener: 2104.56161496 hartree
electener: -4066.55758397 hartree
oneelecener: -6888.03273453 hartree
twoeener: 2821.47515056 hartree
cpcmener: -0.02764061 hartree
kineticenergy: 1956.34960094 hartree
xcener: -132.529739725831 hartree
chargesum: -0.0000000
charge: -0.173615 -0.439738 0.651843 -0.336141 -0.337161 -0.294266 -0.422823 -0.472710 -0.110084 -0.055373 0.251066 0.022105 0.035695 -0.175453 0.510115 -0.232563 -0.241362 0.035202 -0.250008 0.155768 0.129612 0.106044 0.093259 0.091365 0.097856 0.113278 0.128893 0.116207 0.090208 0.090412 0.082757 0.088207 0.087984 0.087193 0.107440 0.095112 0.095725 0.089052 0.088899
qa: -0.1736 -0.4397 0.6518 -0.3361 -0.3372 -0.2943 -0.4228 -0.4727 -0.1101 -0.0554 0.2511 0.0221 0.0357 -0.1755 0.5101 -0.2326 -0.2414 0.0352 -0.2500 0.1558 0.1296 0.1060 0.0933 0.0914 0.0979 0.1133 0.1289 0.1162 0.0902 0.0904 0.0828 0.0882 0.0880 0.0872 0.1074 0.0951 0.0957 0.0891 0.0889
va: 2.2664 2.0196 5.4146 2.1156 2.0996 2.1341 2.0621 2.0256 3.1715 3.8086 4.1423 3.8756 3.8501 3.8541 4.2465 3.9417 3.9703 3.8537 3.9195 1.0101 1.0403 0.9959 0.9947 1.0035 0.9971 1.0238 0.9955 0.9976 1.0042 1.0077 1.0146 1.0034 1.0058 1.0063 0.9952 1.0095 1.0078 1.0040 1.0133
dispcorr: -0.018906040 hartree
energy: -1962.014875058699
dipole: 1.61868 -1.04556 0.57312 -3.33645 2.89172 -0.44473 2.83602 -3.25994 -0.42392
magnitude: 0.84022 au
magnitude: 2.13566 debye
