program: Orca
programVersion: 5.0.4
elementType: S S P O O O O O N C C C C C C C C C C H H H H H H H H H H H H H H H H H H H H
charge: 0
multiplicity: 1
keywords: wb97x-d3
keywords: def2-TZVPP
keywords: def2/J RIJCOSX
keywords: DEFGRID2
keywords: scfconv7
keywords: smallprint printgap noloewdin
keywords: NOSOSCF
formula: C10H20NO5PS2
InChI: InChI=1/C10H20NO5PS2/c1-5-14-10(13)11(4)9(12)8-19-17(18,15-6-2)16-7-3/h5-8H2,1-4H3
39 atoms
S  0.326129 -1.177484 0.811272
S  -2.865304 -0.27811 1.710951
P  -1.613424 -0.62599 0.28595
O  -1.333878 0.589026 -0.714874
O  -1.962796 -1.827556 -0.708831
O  3.58573 0.715286 -1.153767
O  0.411107 2.48471 1.453405
O  3.193539 -0.304798 0.796901
N  1.933488 1.494314 0.11326
C  0.745854 0.202766 1.917867
C  1.031012 1.48548 1.169565
C  -2.436842 1.343478 -1.275477
C  -2.824279 -2.929705 -0.356942
C  1.867639 2.602969 -0.837991
C  2.933438 0.54333 -0.021237
C  -2.537506 2.703787 -0.635282
C  -4.224707 -2.69862 -0.863791
C  4.678795 -0.169483 -1.457673
C  4.206552 -1.478242 -2.043817
H  1.588123 -0.12292 2.52419
H  -0.089905 0.39368 2.591066
H  -3.374868 0.793497 -1.1671
H  -2.227035 1.422329 -2.342167
H  -2.817236 -3.087462 0.723409
H  -2.377046 -3.807092 -0.823148
H  1.759498 2.227308 -1.852489
H  2.753202 3.233201 -0.776766
H  1.002012 3.213981 -0.611718
H  -2.768763 2.630721 0.427226
H  -3.341189 3.263045 -1.11653
H  -1.616553 3.274799 -0.75673
H  -4.69616 -1.849786 -0.368449
H  -4.829864 -3.583327 -0.660859
H  -4.23636 -2.527671 -1.940724
H  5.294401 -0.32353 -0.570806
H  5.272191 0.383408 -2.183985
H  3.599127 -1.3190 -2.93525
H  5.077511 -2.065311 -2.3381
H  3.632764 -2.070487 -1.331763
elementType: S P O N C H
totalener: -1961.99391179 hartree
nucrepener: 2144.31190321 hartree
electener: -4106.30581500 hartree
oneelecener: -6967.09162807 hartree
twoeener: 2860.78581307 hartree
cpcmener: -0.02736724 hartree
kineticenergy: 1956.35373646 hartree
xcener: -132.530208177633 hartree
chargesum: -0.0000000
charge: -0.144341 -0.446801 0.630371 -0.333861 -0.358121 -0.295077 -0.419258 -0.471857 -0.111377 -0.043701 0.235948 0.040398 0.055582 -0.183081 0.504140 -0.244954 -0.242080 0.036691 -0.249222 0.153516 0.123718 0.090995 0.109479 0.087327 0.106861 0.120503 0.134327 0.105734 0.080521 0.103558 0.086596 0.077294 0.096743 0.089940 0.094726 0.107016 0.088651 0.096596 0.086499
qa: -0.1443 -0.4468 0.6304 -0.3339 -0.3581 -0.2951 -0.4193 -0.4719 -0.1114 -0.0437 0.2359 0.0404 0.0556 -0.1831 0.5041 -0.2450 -0.2421 0.0367 -0.2492 0.1535 0.1237 0.0910 0.1095 0.0873 0.1069 0.1205 0.1343 0.1057 0.0805 0.1036 0.0866 0.0773 0.0967 0.0899 0.0947 0.1070 0.0887 0.0966 0.0865
va: 2.3079 1.9852 5.4335 2.0877 2.0940 2.1388 2.0649 2.0149 3.1355 3.7971 4.1235 3.8587 3.8295 3.8742 4.2587 3.9295 3.9219 3.8543 3.9191 1.0153 1.0518 1.0040 0.9974 1.0147 0.9949 0.9962 0.9956 1.0156 1.0180 1.0107 1.0017 1.0170 1.0098 1.0037 1.0093 0.9954 1.0041 1.0079 1.0136
dispcorr: -0.020582323 hartree
energy: -1962.014494114936
dipole: -0.49627 1.35975 0.86348 0.66809 -1.12334 -0.45525 -15.83680 13.39527 -2.44153
magnitude: 2.62943 au
magnitude: 6.68348 debye
