program: Orca
programVersion: 5.0.4
elementType: S S P O O O O O N C C C C C C C C C C H H H H H H H H H H H H H H H H H H H H
charge: 0
multiplicity: 1
keywords: wb97x-d3
keywords: def2-TZVPP
keywords: def2/J RIJCOSX
keywords: DEFGRID2
keywords: scfconv7
keywords: smallprint printgap noloewdin
keywords: NOSOSCF
formula: C10H20NO5PS2
InChI: InChI=1/C10H20NO5PS2/c1-5-14-10(13)11(4)9(12)8-19-17(18,15-6-2)16-7-3/h5-8H2,1-4H3
39 atoms
S  0.262639 -1.171741 0.4502
S  -2.766218 -0.365825 1.811273
P  -1.727379 -0.593613 0.210643
O  -1.597012 0.678738 -0.745766
O  -2.214385 -1.728012 -0.814333
O  3.750709 0.842187 -1.072259
O  0.449306 2.313224 1.581128
O  3.159201 -0.504628 0.610217
N  2.075302 1.492808 0.242757
C  0.751448 -0.015875 1.76864
C  1.082695 1.354976 1.219661
C  -2.663221 1.622329 -0.924929
C  -2.631686 -3.01326 -0.328977
C  2.137797 2.755539 -0.487685
C  3.00998 0.506729 -0.024029
C  -2.068479 3.001066 -1.074772
C  -4.137696 -3.126629 -0.328513
C  4.743656 -0.096556 -1.500558
C  4.150252 -1.218785 -2.32416
H  1.5841 -0.478639 2.290117
H  -0.079448 0.103444 2.464057
H  -3.341072 1.587665 -0.069067
H  -3.224879 1.332593 -1.815596
H  -2.234818 -3.194959 0.673588
H  -2.180613 -3.746837 -0.998067
H  2.00534 2.589533 -1.554279
H  3.087496 3.260668 -0.322523
H  1.342144 3.397642 -0.130719
H  -1.381894 3.050674 -1.919642
H  -1.534431 3.293575 -0.171858
H  -2.865569 3.723947 -1.248624
H  -4.428346 -4.130314 -0.016537
H  -4.548272 -2.952008 -1.322455
H  -4.581995 -2.414867 0.365516
H  5.288761 -0.486716 -0.64009
H  5.433722 0.497623 -2.097858
H  3.48164 -1.843171 -1.734722
H  3.602066 -0.832691 -3.183059
H  4.953752 -1.853074 -2.699712
totalener: -1961.97400241 hartree
nucrepener: 2130.54065399 hartree
electener: -4092.51465640 hartree
oneelecener: -6938.73476890 hartree
twoeener: 2846.22011251 hartree
kineticenergy: 1956.42014039 hartree
xcener: -132.538522859758 hartree
chargesum: 0.0000000
charge: -0.142965 -0.397176 0.617676 -0.313639 -0.335909 -0.290239 -0.343487 -0.413507 -0.134952 -0.085193 0.227247 0.031961 0.023946 -0.182565 0.467611 -0.245498 -0.227538 0.025439 -0.245637 0.147588 0.143939 0.087044 0.095704 0.084957 0.096200 0.113164 0.116005 0.113448 0.079957 0.095385 0.087867 0.078732 0.083065 0.085700 0.092671 0.095530 0.100015 0.084200 0.083253
qa: -0.1430 -0.3972 0.6177 -0.3136 -0.3359 -0.2902 -0.3435 -0.4135 -0.1350 -0.0852 0.2272 0.0320 0.0239 -0.1826 0.4676 -0.2455 -0.2275 0.0254 -0.2456 0.1476 0.1439 0.0870 0.0957 0.0850 0.0962 0.1132 0.1160 0.1134 0.0800 0.0954 0.0879 0.0787 0.0831 0.0857 0.0927 0.0955 0.1000 0.0842 0.0833
va: 2.2968 2.0496 5.4444 2.1229 2.1067 2.1285 2.1416 2.0640 3.1647 3.7966 4.1189 3.8555 3.8887 3.8767 4.2701 3.9287 3.9311 3.8813 3.9143 1.0149 1.0466 1.0201 0.9929 1.0104 0.9930 0.9973 0.9997 1.0240 1.0036 1.0124 1.0123 1.0112 1.0045 1.0240 1.0101 0.9944 1.0129 1.0058 1.0103
dispcorr: -0.019606748 hartree
energy: -1961.993609155468
dipole: 1.76318 -0.88355 0.87964 1.39978 -1.52041 -0.12063 -14.22396 12.69659 -1.52736
magnitude: 1.76668 au
magnitude: 4.49054 debye
