program: Orca
programVersion: 5.0.4
elementType: S S P O O O O O N C C C C C C C C C C H H H H H H H H H H H H H H H H H H H H
charge: 0
multiplicity: 1
keywords: wb97x-d3
keywords: def2-TZVPP
keywords: def2/J RIJCOSX
keywords: DEFGRID2
keywords: scfconv7
keywords: smallprint printgap noloewdin
keywords: NOSOSCF
formula: C10H20NO5PS2
InChI: InChI=1/C10H20NO5PS2/c1-5-14-10(13)11(4)9(12)8-19-17(18,15-6-2)16-7-3/h5-8H2,1-4H3
39 atoms
S  -1.206707 0.307986 -1.782394
S  -0.539045 -0.769148 1.384648
P  -1.880128 -0.510777 0.023032
O  -3.136854 0.397864 0.417969
O  -2.628317 -1.825385 -0.488949
O  4.179559 0.436354 0.610047
O  0.212359 2.347626 -0.218639
O  3.251592 0.054311 -1.391262
N  2.176626 1.317264 0.194982
C  0.575812 0.354282 -1.474967
C  0.953628 1.435569 -0.471758
C  -2.978883 1.699138 1.005845
C  -2.886225 -2.939063 0.374172
C  2.360306 2.083599 1.424061
C  3.212157 0.542477 -0.291534
C  -3.279909 2.787323 0.001891
C  -3.95012 -2.65047 1.409208
C  5.333337 -0.330739 0.249982
C  5.10264 -1.818228 0.402701
H  1.025625 0.567503 -2.445352
H  0.922137 -0.629712 -1.174065
H  -1.972538 1.812775 1.41477
H  -3.678353 1.731969 1.841771
H  -1.954571 -3.249255 0.853522
H  -3.202554 -3.737806 -0.295712
H  1.460474 2.657539 1.607703
H  3.197503 2.773735 1.338318
H  2.529956 1.417925 2.267077
H  -3.23725 3.756498 0.4997
H  -4.276422 2.671519 -0.423469
H  -2.548953 2.793822 -0.803716
H  -3.611737 -1.917152 2.140281
H  -4.187337 -3.568559 1.947729
H  -4.865326 -2.282587 0.947155
H  6.107242 0.011132 0.935859
H  5.647259 -0.085443 -0.765656
H  6.038923 -2.348019 0.224632
H  4.766914 -2.065471 1.409512
H  4.370537 -2.189298 -0.311768
totalener: -1961.97283887 hartree
nucrepener: 2120.61752003 hartree
electener: -4082.59035890 hartree
oneelecener: -6919.17120166 hartree
twoeener: 2836.58084276 hartree
kineticenergy: 1956.42068435 hartree
xcener: -132.541079707711 hartree
chargesum: 0.0000000
charge: -0.127140 -0.428884 0.649166 -0.318488 -0.319652 -0.290565 -0.353137 -0.411104 -0.121055 -0.075284 0.217437 0.030715 0.003007 -0.175749 0.464945 -0.221646 -0.224098 0.025196 -0.249640 0.144074 0.120370 0.079431 0.094069 0.089725 0.094880 0.116953 0.114471 0.112724 0.075787 0.085756 0.086813 0.081212 0.082120 0.089844 0.095861 0.091923 0.083068 0.086376 0.100520
qa: -0.1271 -0.4289 0.6492 -0.3185 -0.3197 -0.2906 -0.3531 -0.4111 -0.1211 -0.0753 0.2174 0.0307 0.0030 -0.1757 0.4649 -0.2216 -0.2241 0.0252 -0.2496 0.1441 0.1204 0.0794 0.0941 0.0897 0.0949 0.1170 0.1145 0.1127 0.0758 0.0858 0.0868 0.0812 0.0821 0.0898 0.0959 0.0919 0.0831 0.0864 0.1005
va: 2.2909 2.0178 5.3906 2.1193 2.1481 2.1245 2.1186 2.0784 3.1545 3.8386 4.1416 3.8975 3.9261 3.8693 4.2689 3.9198 3.8837 3.8843 3.9110 1.0174 1.0429 1.0111 0.9913 1.0104 0.9900 1.0225 0.9991 0.9981 1.0122 1.0051 1.0275 1.0216 1.0111 1.0076 0.9941 1.0100 1.0102 1.0052 1.0137
dispcorr: -0.019879671 hartree
energy: -1961.992718543325
dipole: 4.02303 -3.23145 0.79157 -2.48720 2.22299 -0.26421 9.59834 -8.90182 0.69652
magnitude: 1.08698 au
magnitude: 2.76289 debye
