program: Orca
programVersion: 5.0.4
elementType: S S P O O O O O N C C C C C C C C C C H H H H H H H H H H H H H H H H H H H H
charge: 0
multiplicity: 1
keywords: wb97x-d3
keywords: def2-TZVPP
keywords: def2/J RIJCOSX
keywords: DEFGRID2
keywords: scfconv7
keywords: smallprint printgap noloewdin
keywords: NOSOSCF
formula: C10H20NO5PS2
InChI: InChI=1/C10H20NO5PS2/c1-5-14-10(13)11(4)9(12)8-19-17(18,15-6-2)16-7-3/h5-8H2,1-4H3
39 atoms
S  0.246296 -1.122703 0.182129
S  -2.633618 -0.716344 1.986222
P  -1.758127 -0.554204 0.282848
O  -1.692937 0.913677 -0.347615
O  -2.356737 -1.434751 -0.914951
O  3.062426 -0.327531 -0.104672
O  0.686517 2.311193 1.572839
O  3.126422 0.904406 -1.969475
N  1.920765 1.614604 -0.165917
C  0.908746 -0.030751 1.478444
C  1.179758 1.378994 0.98939
C  -2.796466 1.825563 -0.225457
C  -3.112343 -2.630042 -0.681866
C  1.800323 2.96115 -0.717512
C  2.733184 0.720289 -0.850608
C  -2.295713 3.22144 -0.501038
C  -2.243705 -3.787369 -0.243943
C  3.804109 -1.379368 -0.734585
C  5.291405 -1.103042 -0.736914
H  1.798222 -0.512751 1.876083
H  0.182263 0.044832 2.288358
H  -3.219194 1.756579 0.779134
H  -3.571521 1.537407 -0.94007
H  -3.595961 -2.843151 -1.634587
H  -3.890529 -2.432272 0.058543
H  2.193462 3.697917 -0.020422
H  0.756929 3.194527 -0.918261
H  2.35409 3.012935 -1.646618
H  -1.532502 3.510408 0.22021
H  -3.124009 3.925088 -0.417699
H  -1.883483 3.308311 -1.506168
H  -1.806225 -3.6073 0.737895
H  -1.439643 -3.975551 -0.954855
H  -2.850398 -4.69066 -0.174697
H  3.431344 -1.54707 -1.745496
H  3.576252 -2.264322 -0.140806
H  5.818006 -1.969514 -1.138109
H  5.539727 -0.245131 -1.358477
H  5.663769 -0.926875 0.272151
totalener: -1961.97151208 hartree
nucrepener: 2149.92665961 hartree
electener: -4111.89817169 hartree
oneelecener: -6977.06476510 hartree
twoeener: 2865.16659341 hartree
kineticenergy: 1956.42002938 hartree
xcener: -132.537368738304 hartree
chargesum: -0.0000000
charge: -0.154686 -0.393570 0.616317 -0.310904 -0.333095 -0.316016 -0.344478 -0.383014 -0.121673 -0.047120 0.192812 0.028718 0.027934 -0.169345 0.443947 -0.264860 -0.250037 0.031686 -0.242929 0.133376 0.136131 0.096313 0.096289 0.095540 0.092860 0.113747 0.103250 0.120460 0.096058 0.092192 0.085374 0.090236 0.088846 0.088028 0.102482 0.091029 0.084337 0.100832 0.082935
qa: -0.1547 -0.3936 0.6163 -0.3109 -0.3331 -0.3160 -0.3445 -0.3830 -0.1217 -0.0471 0.1928 0.0287 0.0279 -0.1693 0.4439 -0.2649 -0.2500 0.0317 -0.2429 0.1334 0.1361 0.0963 0.0963 0.0955 0.0929 0.1137 0.1033 0.1205 0.0961 0.0922 0.0854 0.0902 0.0888 0.0880 0.1025 0.0910 0.0843 0.1008 0.0829
va: 2.2802 2.0513 5.4456 2.1366 2.1191 2.0779 2.1356 2.1262 3.1486 3.7941 4.1612 3.8529 3.8786 3.8939 4.3083 3.9476 3.8883 3.8504 3.9311 1.0157 1.0508 1.0113 0.9909 0.9911 1.0161 0.9940 0.9960 1.0211 1.0091 1.0123 0.9996 1.0198 1.0035 1.0148 1.0100 0.9958 1.0097 1.0139 1.0045
dispcorr: -0.020503131 hartree
energy: -1961.992015208117
dipole: 5.34048 -5.02209 0.31839 -0.23284 -0.54024 -0.77307 -7.10635 6.54056 -0.56579
magnitude: 1.00952 au
magnitude: 2.56599 debye
