program: Orca
programVersion: 5.0.4
elementType: S S P O O O O O N C C C C C C C C C C H H H H H H H H H H H H H H H H H H H H
charge: 0
multiplicity: 1
keywords: wb97x-d3
keywords: def2-TZVPP
keywords: def2/J RIJCOSX
keywords: DEFGRID2
keywords: scfconv7
keywords: smallprint printgap noloewdin
keywords: NOSOSCF
formula: C10H20NO5PS2
InChI: InChI=1/C10H20NO5PS2/c1-5-14-10(13)11(4)9(12)8-19-17(18,15-6-2)16-7-3/h5-8H2,1-4H3
39 atoms
S  0.062407 1.263794 0.672635
S  -2.047796 -0.393809 2.623193
P  -1.559098 -0.024428 0.808535
O  -2.728061 0.572735 -0.125014
O  -1.038887 -1.238628 -0.094687
O  3.56907 -0.744626 0.049043
O  0.19035 -0.17535 -2.84775
O  2.864687 1.341502 -0.361622
N  1.840708 -0.470091 -1.327149
C  0.223469 1.444494 -1.135482
C  0.750571 0.219918 -1.858782
C  -3.77361 1.397378 0.399105
C  -1.826844 -2.42197 -0.294322
C  2.019553 -1.867593 -1.702037
C  2.772037 0.151796 -0.515578
C  -3.306333 2.797591 0.727039
C  -2.547622 -2.389567 -1.622475
C  4.611539 -0.254411 0.898955
C  5.820368 0.209716 0.116209
H  0.878092 2.301822 -1.279099
H  -0.744034 1.678618 -1.574508
H  -4.204617 0.919946 1.282002
H  -4.533391 1.414715 -0.381882
H  -2.52246 -2.553756 0.539079
H  -1.119911 -3.250952 -0.2572
H  2.98066 -2.028608 -2.187114
H  1.237781 -2.137614 -2.402232
H  1.950804 -2.510667 -0.826925
H  -2.844004 3.279234 -0.134277
H  -2.5920 2.801736 1.549419
H  -4.162622 3.401552 1.028464
H  -3.306848 -1.610772 -1.64987
H  -3.040472 -3.348311 -1.78877
H  -1.853754 -2.216003 -2.443705
H  4.864691 -1.10522 1.529947
H  4.228959 0.540314 1.540022
H  6.197119 -0.578101 -0.535689
H  5.599007 1.088693 -0.486057
H  6.618496 0.475536 0.809791
totalener: -1961.97228994 hartree
nucrepener: 2160.70482570 hartree
electener: -4122.67711564 hartree
oneelecener: -6998.87119703 hartree
twoeener: 2876.19408139 hartree
kineticenergy: 1956.42189367 hartree
xcener: -132.540149617580 hartree
chargesum: -0.0000000
charge: -0.114326 -0.374723 0.584605 -0.326958 -0.311581 -0.288688 -0.339496 -0.413077 -0.118080 -0.074022 0.191404 0.026593 0.007712 -0.189448 0.460139 -0.240229 -0.219610 0.026614 -0.249781 0.144981 0.128487 0.091709 0.092557 0.088605 0.091308 0.120018 0.109477 0.116506 0.082979 0.090516 0.088815 0.080112 0.085945 0.090770 0.098081 0.093836 0.081897 0.100739 0.085616
qa: -0.1143 -0.3747 0.5846 -0.3270 -0.3116 -0.2887 -0.3395 -0.4131 -0.1181 -0.0740 0.1914 0.0266 0.0077 -0.1894 0.4601 -0.2402 -0.2196 0.0266 -0.2498 0.1450 0.1285 0.0917 0.0926 0.0886 0.0913 0.1200 0.1095 0.1165 0.0830 0.0905 0.0888 0.0801 0.0859 0.0908 0.0981 0.0938 0.0819 0.1007 0.0856
va: 2.2921 2.0979 5.4392 2.0650 2.1009 2.1298 2.1411 2.0680 3.1085 3.8207 4.1990 3.8763 3.8914 3.8816 4.2862 3.9111 3.9253 3.8796 3.9095 1.0162 1.0364 1.0181 0.9898 1.0230 0.9911 1.0011 1.0206 0.9954 1.0035 1.0170 1.0154 1.0168 1.0100 1.0093 0.9942 1.0111 1.0059 1.0127 1.0102
dispcorr: -0.021444852 hartree
energy: -1961.993734792670
dipole: 3.81360 -3.36363 0.44997 -3.48561 3.06775 -0.41786 -7.54859 7.07174 -0.47685
magnitude: 0.77747 au
magnitude: 1.97618 debye
