program: Gaussian 09
title: 000062356
version: EM64L-G09RevD.01
frameworkgroup: C1[X(C3HF5O2)]
method: RPBEPBE
basis: SDD
operation: Freq
keyword: #pfreq=noraman
keyword: PBEPBE/SDD
title: #p freq=noraman PBEPBE/SDD
converged: YES YES NO NO
title: Mulliken charges:
elementType: F F F F F O O C C C H
charge: -0.134296 -0.146231 -0.146173 -0.125588 -0.129016 -0.383384 -0.154986 0.232004 0.407144 0.170283 0.410244
chargesum: 0.00000
title: Mulliken charges with hydrogens summed into heavy atoms:
elementType: F F F F F O O C C C
charge: -0.134296 -0.146231 -0.146173 -0.125588 -0.129016 0.026859 -0.154986 0.232004 0.407144 0.170283
polarizability: 4.39442714e+01 1.71687710e+00 4.28710455e+01 4.91698137e+00 -4.71801430e+00 3.68350938e+01
1716.lowfreq: -10.0314 -5.4189 0.0003 0.0007 0.0017 7.1452 32.6993 50.5503 137.6806
frequency: 32.6576 50.3830 137.6794 200.5298 223.3933 262.0772 316.2827 335.1994 343.7385 420.4825 466.4919 503.8043 550.2722 592.0829 618.5391 678.0755 708.4940 943.5577 1022.9320 1028.9182 1047.1202 1073.2176 1116.1676 1198.1013 1309.1601 1694.3580 3528.8140
redmass: 11.9812 17.1539 10.3602 16.5551 11.4834 14.5350 18.0997 17.1078 12.9062 10.7422 15.0298 7.0405 6.5573 1.8330 3.9150 8.7173 7.3081 12.6236 4.6825 9.1504 10.8685 12.1959 3.9365 11.8444 2.6282 11.5632 1.0648
irintensity: 1.7441 0.2250 1.9496 2.2034 1.4051 1.2539 0.0063 0.5234 1.7506 6.1412 9.5412 7.8402 15.2735 94.8744 109.3437 11.8273 28.4597 127.9884 199.9366 93.1323 226.7131 310.4490 10.7752 56.3068 25.4532 233.3027 63.2177
temp: 298.150 k
press: 1.00000 atm
elementType: 9 9 9 9 9 8 8 6 6 6 1
symmnumber: 1
zpe: 122034.2 jmol-1
zpe.correction: 0.046480 hartree
zpe.thermalcorrener: 0.056105 hartree
zpe.thermalcorrenthalpy: 0.057049 hartree
zpe.thermalcorrgfe: 0.010343 hartree
zpe.sumelectzpe: -763.784100 hartree
zpe.sumelectthermal: -763.774475 hartree
zpe.sumelectthermalent: -763.773531 hartree
zpe.sumelectthermalfe: -763.820237 hartree
dipole: -1.7631 -2.3752 0.2933
dipole: 2.9726
quadrupole: -52.4016 -53.5286 -57.2806
quadrupole: 7.5266 -2.5245 1.2304
quadrupole: 2.0020 0.8750 -2.8770 7.5266 -2.5245 1.2304
hfenergy: -763.8305803 hartree
pointgroup: C01 [X(C3H1F5O2)]
dipole: 0.7931586 -0.7513114 -0.4173339 debye
dipolederiv: -0.2866413 0.027124 0.0608888 0.0445057 -0.4399238 -0.2449315 0.0663568 -0.1563225 -0.4906649 -0.3224582 0.0016078 -0.0093018 0.0174743 -0.376731 0.2350637 -0.00695 0.1499536 -0.5896747 -0.3682751 -0.0113517 -0.0201261 0.0393197 -0.5104972 0.2839194 -0.0827686 0.2340374 -0.5619218 -0.3336276 -0.0718625 -0.077278 -0.0374045 -0.4106191 -0.2448036 0.009007 -0.188817 -0.6319074 -0.7846593 0.2563617 0.0489817 0.1398482 -0.41555 -0.0262382 0.076774 -0.0425642 -0.267611 -0.3423736 0.1401946 0.2041131 0.0597976 -0.7844843 -0.4267608 0.1229334 -0.3786114 -0.7319542 -0.6315246 -0.1117791 -0.3090038 0.0949564 -0.4289379 -0.1371555 -0.1403714 -0.2595233 -0.5960968 0.5098584 0.02181 -0.0731871 -0.0866888 0.8666058 -0.0426555 -0.1449349 -0.0040904 1.0983437 1.4745587 -0.2105348 0.0313595 -0.0469563 1.3016924 0.0038521 -0.0084266 -0.0051864 1.4392653 0.8921168 -0.0778172 0.2396737 -0.2575716 0.8079456 0.6051927 0.2239176 0.6520265 0.9807372 0.1930258 0.0362472 -0.0961201 0.0327193 0.3904994 -0.0054829 -0.1155373 -0.0009021 0.3514847 unknown
polarizability: 44.0383249|-3.3631873|37.9917869|3.5630608|5.5500295|41.6202989 unknown
InChI: InChI=1S/C3HF5O2/c4-2(5,1(9)10)3(6,7)8/h9H
charge 0 multiplicity 1
11 atoms
F  -0.07703 1.552147 0.981221
F  0.086765 1.331231 -1.288265
F  -0.924013 -1.297187 1.012539
F  -1.201097 -1.088532 -1.235135
F  -2.298086 0.304807 0.166643
O  1.678427 -1.000545 -0.85163
O  2.33428 0.279428 0.994829
C  0.116319 0.621351 -0.056834
C  -1.094698 -0.375836 -0.040754
C  1.515372 -0.037853 0.123833
H  2.569862 -1.437909 -0.784247
