program: Orca
programVersion: 5.0.4
elementType: S S P O O O O O N C C C C C C C C C C H H H H H H H H H H H H H H H H H H H H
charge: 0
multiplicity: 1
keywords: wb97x-d3
keywords: def2-TZVPP
keywords: def2/J RIJCOSX
keywords: DEFGRID2
keywords: scfconv7
keywords: smallprint printgap noloewdin
keywords: NOSOSCF
formula: C10H20NO5PS2
InChI: InChI=1/C10H20NO5PS2/c1-5-14-10(13)11(4)9(12)8-19-17(18,15-6-2)16-7-3/h5-8H2,1-4H3
39 atoms
S  0.563226 -1.10905 0.325792
S  -2.318971 -0.436558 2.030148
P  -1.446874 -0.538765 0.320497
O  -1.416541 0.805203 -0.543008
O  -2.015437 -1.603863 -0.732701
O  3.392876 -0.03978 -0.034416
O  0.743752 2.400487 1.511885
O  3.328243 1.089776 -1.962314
N  1.997352 1.723867 -0.221086
C  1.189495 0.08892 1.54248
C  1.317661 1.488681 0.971759
C  -2.355634 1.870902 -0.326603
C  -2.553724 -2.863179 -0.302605
C  1.697025 2.999978 -0.862629
C  2.935824 0.910037 -0.842073
C  -3.731283 1.539913 -0.856424
C  -4.063064 -2.814673 -0.266766
C  4.335517 -0.971334 -0.58273
C  3.679474 -2.047484 -1.419641
H  2.130562 -0.303761 1.917726
H  0.489557 0.147108 2.376348
H  -1.928038 2.723873 -0.852113
H  -2.390253 2.11389 0.736894
H  -2.155678 -3.138886 0.677352
H  -2.198457 -3.598687 -1.024496
H  2.159376 3.019918 -1.841549
H  2.072143 3.831375 -0.268782
H  0.622035 3.11528 -0.979659
H  -4.190428 0.728522 -0.29206
H  -3.697326 1.259447 -1.90847
H  -4.376719 2.413319 -0.759322
H  -4.412011 -2.112272 0.488921
H  -4.4571 -3.800438 -0.017764
H  -4.471898 -2.522982 -1.233788
H  4.819035 -1.405092 0.29193
H  5.09241 -0.435744 -1.156526
H  2.936524 -2.603066 -0.848808
H  3.200179 -1.635511 -2.305381
H  4.442476 -2.752904 -1.750653
totalener: -1961.97036572 hartree
nucrepener: 2164.44947248 hartree
electener: -4126.41983820 hartree
oneelecener: -7006.10811719 hartree
twoeener: 2879.68827898 hartree
kineticenergy: 1956.41509328 hartree
xcener: -132.537935340218 hartree
chargesum: 0.0000000
charge: -0.168231 -0.387790 0.605785 -0.320966 -0.328047 -0.310626 -0.333500 -0.384507 -0.120152 -0.054338 0.181150 0.026473 0.030986 -0.163651 0.438678 -0.222702 -0.238590 0.024210 -0.251229 0.134370 0.143295 0.087634 0.107998 0.086624 0.096355 0.121725 0.112323 0.098036 0.077532 0.090154 0.086084 0.083924 0.085835 0.088090 0.096105 0.099502 0.080486 0.108814 0.092160
qa: -0.1682 -0.3878 0.6058 -0.3210 -0.3280 -0.3106 -0.3335 -0.3845 -0.1202 -0.0543 0.1812 0.0265 0.0310 -0.1637 0.4387 -0.2227 -0.2386 0.0242 -0.2512 0.1344 0.1433 0.0876 0.1080 0.0866 0.0964 0.1217 0.1123 0.0980 0.0775 0.0902 0.0861 0.0839 0.0858 0.0881 0.0961 0.0995 0.0805 0.1088 0.0922
va: 2.2950 2.0458 5.4644 2.1193 2.1087 2.0815 2.1481 2.1248 3.1435 3.7740 4.1498 3.8657 3.8723 3.8967 4.3123 3.9233 3.9205 3.8602 3.9050 1.0172 1.0483 0.9883 1.0108 1.0116 0.9936 1.0202 0.9939 0.9977 1.0190 1.0061 1.0111 1.0201 1.0136 1.0028 0.9949 1.0105 1.0070 1.0122 1.0121
dispcorr: -0.021283427 hartree
energy: -1961.991649150895
dipole: -5.29522 5.53408 0.23886 -3.95365 3.08526 -0.86839 -9.13423 8.65828 -0.47595
magnitude: 1.01867 au
magnitude: 2.58925 debye
