program: Orca
programVersion: 5.0.4
elementType: S S P O O O O O N C C C C C C C C C C H H H H H H H H H H H H H H H H H H H H
charge: 0
multiplicity: 1
keywords: wb97x-d3
keywords: def2-TZVPP
keywords: def2/J RIJCOSX
keywords: DEFGRID2
keywords: scfconv7
keywords: smallprint printgap noloewdin
keywords: NOSOSCF
formula: C10H20NO5PS2
InChI: InChI=1/C10H20NO5PS2/c1-5-14-10(13)11(4)9(12)8-19-17(18,15-6-2)16-7-3/h5-8H2,1-4H3
39 atoms
S  0.014748 -1.286332 0.204973
S  -2.959263 -0.586239 1.756314
P  -1.910543 -0.493819 0.147678
O  -1.621568 0.967639 -0.438575
O  -2.496636 -1.273018 -1.126378
O  3.463297 0.650102 -1.300329
O  0.595574 1.966933 1.885746
O  2.948333 -0.853799 0.273519
N  1.993092 1.239184 0.264044
C  0.646698 -0.377228 1.649648
C  1.08068 1.0313 1.303783
C  -2.59635 2.018047 -0.384617
C  -3.370402 -2.400893 -0.995812
C  2.108267 2.587742 -0.283304
C  2.815439 0.236061 -0.218806
C  -1.874543 3.342554 -0.437719
C  -2.63726 -3.654208 -0.57352
C  4.426135 -0.241504 -1.871808
C  5.747675 -0.202145 -1.135528
H  1.457063 -0.975833 2.057034
H  -0.140396 -0.299921 2.400215
H  -3.181239 1.932978 0.534062
H  -3.277168 1.905871 -1.231923
H  -3.817623 -2.523296 -1.981896
H  -4.167741 -2.165764 -0.287268
H  3.123886 2.966377 -0.1877
H  1.446915 3.240915 0.272259
H  1.820396 2.603187 -1.332338
H  -2.603009 4.15341 -0.436987
H  -1.273216 3.434765 -1.34211
H  -1.227285 3.468015 0.428783
H  -1.817379 -3.886612 -1.252551
H  -3.328327 -4.497669 -0.578211
H  -2.235868 -3.561656 0.435515
H  4.544878 0.112301 -2.895009
H  4.025629 -1.255154 -1.907931
H  6.475792 -0.815374 -1.667183
H  6.143171 0.812143 -1.084193
H  5.659243 -0.596198 -0.124747
totalener: -1961.97383761 hartree
nucrepener: 2133.94827290 hartree
electener: -4095.92211050 hartree
oneelecener: -6945.55823114 hartree
twoeener: 2849.63612064 hartree
kineticenergy: 1956.42094254 hartree
xcener: -132.539420235119 hartree
chargesum: -0.0000000
charge: -0.131268 -0.399301 0.612473 -0.314250 -0.335732 -0.290206 -0.342913 -0.414905 -0.123918 -0.066620 0.208897 0.026493 0.026604 -0.187310 0.463241 -0.253409 -0.246361 0.027576 -0.250590 0.146825 0.135630 0.092043 0.095646 0.093097 0.091486 0.116517 0.112347 0.116238 0.091026 0.080782 0.094990 0.089171 0.086462 0.089911 0.097118 0.092703 0.085935 0.082630 0.100939
qa: -0.1313 -0.3993 0.6125 -0.3143 -0.3357 -0.2902 -0.3429 -0.4149 -0.1239 -0.0666 0.2089 0.0265 0.0266 -0.1873 0.4632 -0.2534 -0.2464 0.0276 -0.2506 0.1468 0.1356 0.0920 0.0956 0.0931 0.0915 0.1165 0.1123 0.1162 0.0910 0.0808 0.0950 0.0892 0.0865 0.0899 0.0971 0.0927 0.0859 0.0826 0.1009
va: 2.2937 2.0483 5.4361 2.1249 2.1156 2.1281 2.1400 2.0624 3.1444 3.7984 4.1364 3.8653 3.8840 3.8787 4.2776 3.9363 3.8884 3.8786 3.9115 1.0140 1.0476 1.0142 0.9915 0.9910 1.0172 1.0009 1.0227 0.9955 1.0116 1.0029 1.0115 1.0037 1.0145 1.0192 0.9938 1.0113 1.0101 1.0058 1.0125
dispcorr: -0.019937942 hartree
energy: -1961.993775548739
dipole: 8.75908 -7.88990 0.86919 4.45947 -4.28106 0.17840 -10.52109 8.95224 -1.56884
magnitude: 1.80238 au
magnitude: 4.58129 debye
