program: Gaussian 09
title: 000006191
version: EM64L-G09RevD.01
frameworkgroup: C1[X(C6H4N2O5)]
method: RPBEPBE
basis: SDD
operation: Freq
keyword: #pfreq=noraman
keyword: PBEPBE/SDD
title: #p freq=noraman PBEPBE/SDD
converged: NO YES NO YES
title: Mulliken charges:
elementType: O O O O O N N C C C C C C H H H H
charge: -0.404238 -0.146028 -0.145971 -0.149173 -0.149171 0.004514 -0.022182 0.161169 0.352538 0.243535 -0.340798 -0.370906 -0.174204 0.270386 0.243162 0.248855 0.378512
chargesum: 0.00000
title: Mulliken charges with hydrogens summed into heavy atoms:
elementType: O O O O O N N C C C C C C
charge: -0.025725 -0.146028 -0.145971 -0.149173 -0.149171 0.004514 -0.022182 0.161169 0.352538 0.243535 -0.070412 -0.127743 0.074652
polarizability: 1.12244387e+02 3.80926468e+00 1.06738973e+02 -1.16687185e-02 1.48693618e-02 7.11757047e+01
1716.lowfreq: -73.7949 -28.0578 -0.0010 -0.0009 -0.0007 3.2638 5.5965 12.4353 80.0636
frequency: -73.7949 -28.0142 80.0597 120.6223 137.8829 196.6534 204.6640 306.4265 310.1389 338.5197 359.0968 444.5326 446.2624 539.7668 561.7268 619.2765 658.5363 662.3256 696.2350 717.1818 741.7518 780.1986 792.0100 873.1043 922.4035 963.1259 1049.6638 1105.7285 1136.0109 1174.1925 1219.1291 1238.9107 1257.1843 1279.4104 1380.0695 1391.6640 1401.7208 1446.7598 1477.4367 1594.3779 1617.8807 3139.9979 3165.8674 3185.0913 3598.8009
redmass: 13.8741 15.0025 9.0970 14.9967 7.0906 8.0450 5.9496 6.5905 12.7161 1.1076 6.7955 6.3600 5.5728 7.3740 3.9235 5.7514 13.6489 9.8134 7.8874 3.3672 12.6101 1.6471 8.7737 1.4116 7.3533 1.3151 3.6977 2.1367 1.9160 1.1884 2.3161 9.3650 3.0260 3.0231 14.6420 7.8185 14.6414 2.6908 3.0731 7.5436 7.3765 1.0897 1.0911 1.0990 1.0668
irintensity: 0.0056 0.1747 0.0630 1.1117 1.6324 0.0292 0.3455 0.4414 2.3832 143.6265 8.9307 18.6782 5.9973 6.9746 1.8224 1.0368 0.4406 16.8587 4.8994 18.7902 43.3616 67.4160 20.0231 0.0106 60.8319 0.3761 4.8789 28.1834 109.9603 8.5083 73.4606 57.4028 48.1982 66.2730 9.8358 20.5421 296.7537 26.8130 13.2517 26.1437 49.6128 5.4441 3.3014 2.4790 75.3584
temp: 298.150 k
press: 1.00000 atm
elementType: 8 8 8 8 8 7 7 6 6 6 6 6 6 1 1 1 1
symmnumber: 1
zpe: 271148.0 jmol-1
zpe.correction: 0.103275 hartree
zpe.thermalcorrener: 0.113054 hartree
zpe.thermalcorrenthalpy: 0.113999 hartree
zpe.thermalcorrgfe: 0.067619 hartree
zpe.sumelectzpe: -715.517528 hartree
zpe.sumelectthermal: -715.507748 hartree
zpe.sumelectthermalent: -715.506804 hartree
zpe.sumelectthermalfe: -715.553184 hartree
dipole: 6.4743 5.5072 -0.0006
dipole: 8.4998
quadrupole: -63.0281 -71.8129 -81.9660
quadrupole: 1.8893 0.0061 -0.0079
quadrupole: 9.2409 0.4561 -9.6970 1.8893 0.0061 -0.0079
hfenergy: -715.6208026 hartree
pointgroup: C01 [X(C6H4N2O5)]
dipole: -2.7222205 1.9422296 0.0000405 debye
dipolederiv: -0.6819536 -0.5973112 -0.0000233 -0.7207857 -0.7909462 -0.0000698 0.0000003 -0.0000753 -0.3693839 -0.2099213 0.1405371 0.0541569 0.1312538 -0.5228187 -0.171213 0.0064115 -0.004546 -0.6347469 -0.2096663 0.1403532 -0.0535091 0.1310174 -0.5229413 0.171416 -0.0058062 0.0046404 -0.63468 -0.5872332 0.0095419 -0.1859139 0.0338113 -0.1693191 -0.0058464 -0.0024041 0.0016815 -0.6356731 -0.5872966 0.0090267 0.1860004 0.0333599 -0.1692804 0.0070017 0.0024499 -0.0006022 -0.6356151 0.2226791 -0.3525973 -0.0007173 -0.3312061 0.9729591 -0.0002245 -0.000611 -0.0000746 1.2142839 1.0818219 -0.022769 -0.0001336 -0.1015771 0.0689884 -0.0013059 -0.0001246 -0.0011316 1.2014772 -0.1039118 -0.2717665 0.0000771 0.101296 0.0186239 0.0000279 -0.0002264 0.0000201 -0.077663 0.1802714 0.1470228 0.0000116 -0.0451064 0.3693488 0.0001757 0.0001511 -0.0001078 -0.0262323 0.6794967 0.6040735 0.000042 0.7188469 0.6760435 0.0000846 -0.0000725 0.0002088 0.1102055 -0.2737555 0.0807898 -0.0000152 0.0819803 -0.1531943 -0.0000071 0.000288 -0.0000427 -0.1327352 -0.0244975 0.0648733 -0.0000071 -0.3335063 -0.2477675 -0.0000242 0.0000058 0.0000006 -0.1782626 0.239123 -0.1044963 0.0000279 0.1093133 0.1082223 0.0000026 -0.0000344 0.0000086 -0.095473 0.0452609 -0.053969 0.0000079 -0.0350131 0.0389113 -0.000015 -0.0000124 0.0000405 0.1681219 -0.0827798 0.0018871 -0.0000055 -0.0244287 0.0770472 -0.0000037 -0.000002 -0.0000211 0.1760638 0.0586451 0.0550707 -0.0000013 0.0564686 -0.0385449 -0.0000023 -0.0000212 -0.000007 0.1596221 0.2537176 0.1497332 0.0000025 0.194276 0.2846678 0.0000032 0.0000082 0.0000077 0.3906906 unknown
polarizability: 112.8501618|-3.2876295|106.1331883|-0.0127994|-0.0229597|71.1757147 unknown
InChI: InChI=1S/C6H4N2O5/c9-5-3-1-2-4(7(10)11)6(5)8(12)13/h1-3,9H
charge 0 multiplicity 1
17 atoms
O  -2.541395 -1.301801 -0.000013
O  0.375546 -2.259885 -1.144411
O  0.374036 -2.260338 1.144702
O  2.542412 0.548331 1.144908
O  2.542658 0.551075 -1.145046
N  0.170403 -1.713308 0.000126
N  1.959134 0.606725 -0.000063
C  -0.369532 -0.325503 0.000039
C  0.479343 0.793131 -0.000016
C  -1.772484 -0.14367 0.000016
C  -0.031236 2.104299 -0.000029
C  -2.301753 1.168532 0.000006
C  -1.431956 2.279628 0.000008
H  0.649406 2.959572 -0.00008
H  -3.387576 1.318239 -0.000007
H  -1.847991 3.291229 0.000012
H  -3.510716 -1.107454 -0.000049
