program: Orca
programVersion: 5.0.4
elementType: S S P O O O O O N C C C C C C C C C C H H H H H H H H H H H H H H H H H H H H
charge: 0
multiplicity: 1
keywords: wb97x-d3
keywords: def2-TZVPP
keywords: def2/J RIJCOSX
keywords: DEFGRID2
keywords: scfconv7
keywords: smallprint printgap noloewdin
keywords: NOSOSCF
formula: C10H20NO5PS2
InChI: InChI=1/C10H20NO5PS2/c1-5-14-10(13)11(4)9(12)8-19-17(18,15-6-2)16-7-3/h5-8H2,1-4H3
39 atoms
S  0.242764 -1.151515 0.189728
S  -2.627127 -0.509458 1.940977
P  -1.704412 -0.399805 0.258113
O  -1.485374 1.066313 -0.340664
O  -2.358129 -1.195029 -0.969679
O  3.101356 -0.405412 -0.119142
O  0.803281 2.223398 1.675966
O  3.102443 0.848706 -1.970382
N  1.982078 1.549756 -0.109571
C  0.963921 -0.120419 1.503854
C  1.262143 1.298092 1.054426
C  -2.33671 2.167261 0.014574
C  -3.186782 -2.348649 -0.774722
C  1.868666 2.909001 -0.628793
C  2.753389 0.654201 -0.838745
C  -3.703849 2.061695 -0.621072
C  -2.39713 -3.568688 -0.356402
C  3.817039 -1.450812 -0.788869
C  5.301713 -1.169592 -0.859475
H  1.848411 -0.640181 1.863477
H  0.2578 -0.051319 2.331938
H  -1.804768 3.049851 -0.337927
H  -2.410993 2.23221 1.101559
H  -3.669587 -2.508084 -1.738136
H  -3.961129 -2.121292 -0.038701
H  2.279741 3.625266 0.079028
H  0.824968 3.158305 -0.809678
H  2.409108 2.976124 -1.564794
H  -3.633337 1.941334 -1.701512
H  -4.270336 2.970978 -0.418359
H  -4.269562 1.22478 -0.211561
H  -1.59528 -3.787953 -1.061004
H  -3.059734 -4.433941 -0.321475
H  -1.964443 -3.444313 0.63613
H  3.397757 -1.614925 -1.782099
H  3.620548 -2.339571 -0.189697
H  5.719548 -0.992078 0.131423
H  5.812141 -2.034693 -1.284155
H  5.51912 -0.311339 -1.49194
totalener: -1961.97065057 hartree
nucrepener: 2160.44380340 hartree
electener: -4122.41445397 hartree
oneelecener: -6998.11137425 hartree
twoeener: 2875.69692028 hartree
kineticenergy: 1956.41991994 hartree
xcener: -132.538674315494 hartree
chargesum: 0.0000000
charge: -0.157960 -0.389230 0.605744 -0.325285 -0.328228 -0.314662 -0.339279 -0.382864 -0.117248 -0.047091 0.179222 0.028447 0.033502 -0.166129 0.442130 -0.224284 -0.253610 0.031418 -0.243934 0.136063 0.135014 0.085854 0.104508 0.096883 0.090593 0.113619 0.102018 0.118429 0.089898 0.085276 0.079794 0.089590 0.089009 0.090916 0.102033 0.091045 0.083004 0.084156 0.101639
qa: -0.1580 -0.3892 0.6057 -0.3253 -0.3282 -0.3147 -0.3393 -0.3829 -0.1172 -0.0471 0.1792 0.0284 0.0335 -0.1661 0.4421 -0.2243 -0.2536 0.0314 -0.2439 0.1361 0.1350 0.0859 0.1045 0.0969 0.0906 0.1136 0.1020 0.1184 0.0899 0.0853 0.0798 0.0896 0.0890 0.0909 0.1020 0.0910 0.0830 0.0842 0.1016
va: 2.2817 2.0462 5.4484 2.1234 2.1135 2.0796 2.1434 2.1256 3.1449 3.7892 4.1670 3.8725 3.8660 3.8972 4.3101 3.9098 3.8966 3.8536 3.9291 1.0141 1.0518 0.9899 1.0138 0.9912 1.0157 0.9935 0.9964 1.0202 1.0062 1.0103 1.0232 1.0033 1.0145 1.0190 1.0099 0.9954 1.0045 1.0097 1.0140
dispcorr: -0.020858164 hartree
energy: -1961.991508735843
dipole: 2.50664 -2.19826 0.30838 -2.38944 1.61645 -0.77299 -7.39816 6.85995 -0.53821
magnitude: 0.99110 au
magnitude: 2.51918 debye
