program: Orca
programVersion: 5.0.4
elementType: S S P O O O O O N C C C C C C C C C C H H H H H H H H H H H H H H H H H H H H
charge: 0
multiplicity: 1
keywords: wb97x-d3
keywords: def2-TZVPP
keywords: def2/J RIJCOSX
keywords: DEFGRID2
keywords: scfconv7
keywords: smallprint printgap noloewdin
keywords: NOSOSCF
formula: C10H20NO5PS2
InChI: InChI=1/C10H20NO5PS2/c1-5-14-10(13)11(4)9(12)8-19-17(18,15-6-2)16-7-3/h5-8H2,1-4H3
39 atoms
S  0.15201 0.8257 -1.112418
S  -2.760275 1.633544 0.481102
P  -1.602311 0.235767 -0.153566
O  -2.197308 -0.747488 -1.272383
O  -1.058973 -0.795455 0.9435
O  3.790897 -0.979275 -0.076568
O  0.934568 1.380643 2.455225
O  3.131304 1.000494 -0.881093
N  2.351244 0.213996 1.133898
C  0.797868 1.945679 0.169481
C  1.372661 1.189206 1.350139
C  -3.080418 -0.256493 -2.291492
C  -1.759689 -1.019441 2.176493
C  2.593669 -0.756444 2.196511
C  3.093338 0.148183 -0.03263
C  -4.516039 -0.592382 -1.963828
C  -3.023416 -1.825857 1.981623
C  4.593309 -1.205783 -1.241134
C  3.774166 -1.714275 -2.407477
H  -0.01493 2.566924 0.545361
H  1.529929 2.581597 -0.320518
H  -2.763441 -0.737615 -3.21727
H  -2.960665 0.822565 -2.420469
H  -1.975478 -0.060467 2.651239
H  -1.046791 -1.552378 2.804399
H  2.337051 -1.760954 1.86579
H  1.974231 -0.494499 3.045889
H  3.634606 -0.741444 2.513413
H  -5.162604 -0.283564 -2.786058
H  -4.842576 -0.070997 -1.065034
H  -4.647766 -1.664256 -1.816916
H  -3.456083 -2.064486 2.953633
H  -2.823942 -2.761909 1.46105
H  -3.770174 -1.266191 1.418755
H  5.321608 -1.951743 -0.925486
H  5.133106 -0.296115 -1.508392
H  3.238275 -2.626978 -2.148199
H  3.055081 -0.972052 -2.749073
H  4.438762 -1.943297 -3.241153
totalener: -1961.97316975 hartree
nucrepener: 2150.68390951 hartree
electener: -4112.65707926 hartree
oneelecener: -6978.97215904 hartree
twoeener: 2866.31507978 hartree
kineticenergy: 1956.41457997 hartree
xcener: -132.538435309093 hartree
chargesum: 0.0000000
charge: -0.139998 -0.393983 0.600533 -0.330857 -0.323380 -0.288734 -0.336365 -0.411254 -0.125288 -0.078307 0.204806 0.031571 0.026725 -0.184330 0.460295 -0.238451 -0.221163 0.025491 -0.245145 0.137901 0.150632 0.095554 0.086738 0.105478 0.086348 0.114494 0.112844 0.115582 0.085220 0.084860 0.085941 0.085001 0.088120 0.077900 0.095547 0.092484 0.085078 0.099246 0.082867
qa: -0.1400 -0.3940 0.6005 -0.3309 -0.3234 -0.2887 -0.3364 -0.4113 -0.1253 -0.0783 0.2048 0.0316 0.0267 -0.1843 0.4603 -0.2385 -0.2212 0.0255 -0.2451 0.1379 0.1506 0.0956 0.0867 0.1055 0.0863 0.1145 0.1128 0.1156 0.0852 0.0849 0.0859 0.0850 0.0881 0.0779 0.0955 0.0925 0.0851 0.0992 0.0829
va: 2.3046 2.0399 5.4465 2.1016 2.1127 2.1280 2.1488 2.0673 3.1454 3.7922 4.1304 3.8748 3.8695 3.8724 4.2856 3.9197 3.9142 3.8797 3.9146 1.0477 1.0136 0.9939 1.0120 1.0134 0.9909 0.9953 1.0272 1.0005 1.0136 1.0201 1.0027 1.0115 1.0066 1.0196 0.9945 1.0103 1.0057 1.0131 1.0106
dispcorr: -0.020447412 hartree
energy: -1961.993617160920
dipole: -1.94486 2.63181 0.68695 -15.83234 14.30408 -1.52826 -2.89734 2.39278 -0.50455
magnitude: 1.74987 au
magnitude: 4.44781 debye
