program: Orca
programVersion: 5.0.4
elementType: S S P O O O O O N C C C C C C C C C C H H H H H H H H H H H H H H H H H H H H
charge: 0
multiplicity: 1
keywords: wb97x-d3
keywords: def2-TZVPP
keywords: def2/J RIJCOSX
keywords: DEFGRID2
keywords: scfconv7
keywords: smallprint printgap noloewdin
keywords: NOSOSCF
formula: C10H20NO5PS2
InChI: InChI=1/C10H20NO5PS2/c1-5-14-10(13)11(4)9(12)8-19-17(18,15-6-2)16-7-3/h5-8H2,1-4H3
39 atoms
S  -0.51982 -0.253677 -1.469561
S  -1.366166 0.249095 1.823074
P  -1.944845 -0.217219 0.045591
O  -3.094109 0.700167 -0.578185
O  -2.533223 -1.698517 -0.135394
O  3.331476 -0.523105 0.159775
O  0.518687 2.957195 0.310889
O  2.422311 0.19075 -1.754018
N  1.804799 1.096123 0.264554
C  0.01169 1.483771 -1.456035
C  0.79961 1.923789 -0.237277
C  -3.877649 1.619559 0.200033
C  -2.165673 -2.776046 0.733627
C  2.203379 1.277233 1.656709
C  2.509666 0.235174 -0.554566
C  -3.313378 3.017652 0.106568
C  -0.759223 -3.272303 0.481126
C  4.170943 -1.425833 -0.565578
C  5.105391 -2.075741 0.426399
H  -0.856795 2.136539 -1.52782
H  0.597039 1.608387 -2.365475
H  -3.925053 1.293954 1.240928
H  -4.883082 1.568549 -0.21771
H  -2.896951 -3.557741 0.530806
H  -2.280944 -2.463479 1.773874
H  1.497845 1.947576 2.132531
H  3.200148 1.709766 1.733994
H  2.18094 0.326082 2.180807
H  -3.952842 3.708195 0.657581
H  -3.269262 3.360077 -0.927573
H  -2.313805 3.07369 0.53697
H  -0.016937 -2.518735 0.744899
H  -0.614426 -3.551193 -0.56227
H  -0.570205 -4.152944 1.095781
H  4.728917 -0.88258 -1.3310
H  3.554729 -2.169643 -1.075161
H  5.75541 -2.777947 -0.094816
H  5.738467 -1.339593 0.920909
H  4.560401 -2.629255 1.190258
totalener: -1961.97178738 hartree
nucrepener: 2169.01821753 hartree
electener: -4130.99000491 hartree
oneelecener: -7015.70287775 hartree
twoeener: 2884.71287285 hartree
kineticenergy: 1956.41994920 hartree
xcener: -132.540507863541 hartree
chargesum: 0.0000000
charge: -0.117676 -0.409447 0.630475 -0.323735 -0.332190 -0.292644 -0.334192 -0.406262 -0.117187 -0.089653 0.196013 0.044775 0.024083 -0.187111 0.454658 -0.264067 -0.248120 0.026243 -0.231287 0.141116 0.149971 0.083442 0.095633 0.095648 0.091919 0.115402 0.117736 0.116135 0.088590 0.083842 0.103103 0.078974 0.093195 0.087274 0.091206 0.093349 0.081528 0.083915 0.085346
qa: -0.1177 -0.4094 0.6305 -0.3237 -0.3322 -0.2926 -0.3342 -0.4063 -0.1172 -0.0897 0.1960 0.0448 0.0241 -0.1871 0.4547 -0.2641 -0.2481 0.0262 -0.2313 0.1411 0.1500 0.0834 0.0956 0.0956 0.0919 0.1154 0.1177 0.1161 0.0886 0.0838 0.1031 0.0790 0.0932 0.0873 0.0912 0.0933 0.0815 0.0839 0.0853
va: 2.3085 2.0245 5.4240 2.1272 2.1301 2.1134 2.1318 2.0802 3.1258 3.8480 4.1434 3.8489 3.8928 3.8869 4.2796 3.9139 3.8909 3.8767 3.9544 1.0149 1.0148 1.0185 0.9927 0.9914 1.0153 1.0174 0.9998 0.9973 1.0166 1.0014 1.0152 1.0189 1.0027 1.0150 1.0026 0.9976 1.0089 1.0053 1.0045
dispcorr: -0.020935092 hartree
energy: -1961.992722470951
dipole: 8.88499 -8.38477 0.50021 -6.34577 5.37010 -0.97567 6.11042 -5.86842 0.24200
magnitude: 1.12282 au
magnitude: 2.85397 debye
