program: Orca
programVersion: 5.0.4
elementType: S S P O O O O O N C C C C C C C C C C H H H H H H H H H H H H H H H H H H H H
charge: 0
multiplicity: 1
keywords: wb97x-d3
keywords: def2-TZVPP
keywords: def2/J RIJCOSX
keywords: DEFGRID2
keywords: scfconv7
keywords: smallprint printgap noloewdin
keywords: NOSOSCF
formula: C10H20NO5PS2
InChI: InChI=1/C10H20NO5PS2/c1-5-14-10(13)11(4)9(12)8-19-17(18,15-6-2)16-7-3/h5-8H2,1-4H3
39 atoms
S  0.107316 -0.510077 -1.580214
S  -0.842659 -0.348782 1.721017
P  -1.376972 -0.563443 -0.117232
O  -2.456555 0.491815 -0.650689
O  -1.969834 -1.996829 -0.514838
O  3.635496 -0.025499 0.596611
O  0.254262 2.87257 0.038808
O  3.014081 0.434771 -1.503263
N  1.955875 1.403909 0.29128
C  0.405389 1.281079 -1.686859
C  0.872678 1.935037 -0.399765
C  -3.01579 1.542379 0.154814
C  -2.273823 -3.022935 0.437082
C  2.119263 1.761679 1.697647
C  2.882161 0.571897 -0.315657
C  -4.220674 1.071587 0.934185
C  -3.638674 -2.840532 1.058499
C  4.617648 -0.954196 0.126461
C  4.009298 -2.299188 -0.206203
H  -0.51183 1.784444 -1.983827
H  1.134268 1.395574 -2.486132
H  -3.287453 2.322465 -0.555707
H  -2.254316 1.948543 0.821368
H  -1.501714 -3.053931 1.208941
H  -2.224463 -3.952568 -0.129132
H  3.096261 2.207247 1.874379
H  1.998126 0.885602 2.329753
H  1.35691 2.485669 1.957261
H  -3.934926 0.358165 1.705979
H  -4.96412 0.610839 0.284217
H  -4.687842 1.923315 1.429774
H  -3.66873 -1.95486 1.691579
H  -3.871078 -3.702133 1.685292
H  -4.415726 -2.756322 0.299558
H  5.323249 -1.042035 0.95158
H  5.148421 -0.539632 -0.731742
H  3.484488 -2.717735 0.652063
H  3.313631 -2.231497 -1.040443
H  4.801132 -2.994606 -0.48627
totalener: -1961.97110769 hartree
nucrepener: 2176.44541161 hartree
electener: -4138.41651930 hartree
oneelecener: -7030.63388570 hartree
twoeener: 2892.21736640 hartree
kineticenergy: 1956.41862808 hartree
xcener: -132.542139896520 hartree
chargesum: 0.0000000
charge: -0.125897 -0.413943 0.628802 -0.323135 -0.328105 -0.282447 -0.347871 -0.407825 -0.120307 -0.097446 0.187307 0.045580 0.028342 -0.182579 0.454496 -0.250044 -0.240107 0.026568 -0.245674 0.139739 0.151206 0.096414 0.099640 0.087341 0.095995 0.116655 0.111898 0.121065 0.080251 0.090879 0.090832 0.081046 0.087470 0.091052 0.095235 0.090976 0.086211 0.098959 0.081420
qa: -0.1259 -0.4139 0.6288 -0.3231 -0.3281 -0.2824 -0.3479 -0.4078 -0.1203 -0.0974 0.1873 0.0456 0.0283 -0.1826 0.4545 -0.2500 -0.2401 0.0266 -0.2457 0.1397 0.1512 0.0964 0.0996 0.0873 0.0960 0.1167 0.1119 0.1211 0.0803 0.0909 0.0908 0.0810 0.0875 0.0911 0.0952 0.0910 0.0862 0.0990 0.0814
va: 2.3138 2.0090 5.4079 2.1119 2.1338 2.1306 2.1282 2.0725 3.1342 3.8332 4.1708 3.8417 3.8811 3.8610 4.2933 3.9334 3.9056 3.8803 3.9146 1.0181 1.0154 0.9925 1.0116 1.0176 0.9919 1.0020 1.0005 1.0222 1.0126 1.0028 1.0128 1.0121 1.0136 1.0050 0.9948 1.0105 1.0060 1.0135 1.0109
dispcorr: -0.021602824 hartree
energy: -1961.992710516821
dipole: -4.89671 4.98174 0.08502 -6.95595 6.25051 -0.70544 8.76873 -8.36725 0.40148
magnitude: 0.81612 au
magnitude: 2.07442 debye
