program: Orca
programVersion: 5.0.4
elementType: S S P O O O O O N C C C C C C C C C C H H H H H H H H H H H H H H H H H H H H
charge: 0
multiplicity: 1
keywords: wb97x-d3
keywords: def2-TZVPP
keywords: def2/J RIJCOSX
keywords: DEFGRID2
keywords: scfconv7
keywords: smallprint printgap noloewdin
keywords: NOSOSCF
formula: C10H20NO5PS2
InChI: InChI=1/C10H20NO5PS2/c1-5-14-10(13)11(4)9(12)8-19-17(18,15-6-2)16-7-3/h5-8H2,1-4H3
39 atoms
S  -1.481201 0.166793 -1.434817
S  -0.63471 -0.756891 1.708073
P  -2.089788 -0.351205 0.515245
O  -3.135409 0.764976 0.953352
O  -3.175483 -1.499156 0.267211
O  4.196546 0.30557 0.318062
O  0.205238 2.248301 -0.247566
O  2.962682 -0.429543 -1.395033
N  2.166805 1.179353 0.04337
C  0.321075 0.104855 -1.278769
C  0.870556 1.271844 -0.472528
C  -2.723267 2.063739 1.405985
C  -2.759354 -2.807284 -0.125335
C  2.553008 2.131835 1.081973
C  3.101186 0.275045 -0.429862
C  -3.033897 3.114841 0.366389
C  -3.996708 -3.619241 -0.425945
C  5.268221 -0.563784 -0.060495
C  6.389148 -0.359557 0.929983
H  0.698363 0.141948 -2.301592
H  0.618905 -0.853342 -0.863689
H  -1.66113 2.063766 1.657681
H  -3.278734 2.24542 2.326392
H  -2.175113 -3.260033 0.679627
H  -2.117801 -2.743478 -1.010429
H  1.698802 2.756204 1.311513
H  3.36745 2.772699 0.749118
H  2.858267 1.608404 1.984585
H  -2.452764 2.957529 -0.539504
H  -2.77734 4.09821 0.761628
H  -4.093573 3.120757 0.112572
H  -4.564011 -3.185139 -1.248248
H  -4.647772 -3.685283 0.444824
H  -3.710957 -4.631549 -0.710619
H  5.592779 -0.330801 -1.076727
H  4.922579 -1.59936 -0.055675
H  7.221424 -1.014901 0.674977
H  6.755824 0.666265 0.9166
H  6.074862 -0.599156 1.945313
totalener: -1961.97586384 hartree
nucrepener: 2092.45678085 hartree
electener: -4054.43264469 hartree
oneelecener: -6862.67097465 hartree
twoeener: 2808.23832996 hartree
kineticenergy: 1956.40122254 hartree
xcener: -132.536082195113 hartree
chargesum: 0.0000000
charge: -0.152587 -0.415706 0.639763 -0.306676 -0.306260 -0.290035 -0.363453 -0.402155 -0.122246 -0.064121 0.231010 0.025239 0.015814 -0.174012 0.457408 -0.221271 -0.233005 0.026931 -0.230472 0.142406 0.116888 0.074216 0.098004 0.098383 0.080852 0.116393 0.112102 0.112767 0.087243 0.075532 0.087559 0.085809 0.087918 0.073968 0.091071 0.092648 0.082114 0.083817 0.086143
qa: -0.1526 -0.4157 0.6398 -0.3067 -0.3063 -0.2900 -0.3635 -0.4022 -0.1222 -0.0641 0.2310 0.0252 0.0158 -0.1740 0.4574 -0.2213 -0.2330 0.0269 -0.2305 0.1424 0.1169 0.0742 0.0980 0.0984 0.0809 0.1164 0.1121 0.1128 0.0872 0.0755 0.0876 0.0858 0.0879 0.0740 0.0911 0.0926 0.0821 0.0838 0.0861
va: 2.2843 2.0365 5.4349 2.1617 2.1473 2.1191 2.1111 2.0945 3.1695 3.8365 4.1326 3.9049 3.8765 3.8735 4.2773 3.9228 3.9674 3.8755 3.9547 1.0165 1.0481 1.0119 0.9923 1.0013 1.0001 1.0230 0.9984 0.9985 1.0231 1.0119 1.0051 1.0061 1.0059 1.0076 0.9996 0.9991 1.0091 1.0049 1.0050
dispcorr: -0.019023755 hartree
energy: -1961.994887593450
dipole: 10.04354 -8.70210 1.34145 -0.71433 0.59263 -0.12170 2.68518 -2.64875 0.03643
magnitude: 1.34745 au
magnitude: 3.42494 debye
