program: Orca
programVersion: 5.0.4
elementType: S S P O O O O O N C C C C C C C C C C H H H H H H H H H H H H H H H H H H H H
charge: 0
multiplicity: 1
keywords: wb97x-d3
keywords: def2-TZVPP
keywords: def2/J RIJCOSX
keywords: DEFGRID2
keywords: scfconv7
keywords: smallprint printgap noloewdin
keywords: NOSOSCF
formula: C10H20NO5PS2
InChI: InChI=1/C10H20NO5PS2/c1-5-14-10(13)11(4)9(12)8-19-17(18,15-6-2)16-7-3/h5-8H2,1-4H3
39 atoms
S  -1.492899 0.16734 -1.426096
S  -0.607336 -0.769661 1.703068
P  -2.07715 -0.371749 0.525664
O  -3.129398 0.730162 0.983413
O  -3.151325 -1.530697 0.278165
O  4.158426 0.265508 0.351862
O  0.195919 2.256398 -0.262553
O  2.944706 -0.460973 -1.378822
N  2.164435 1.19565 0.014344
C  0.310596 0.110256 -1.286517
C  0.863478 1.281446 -0.488638
C  -2.722299 2.028709 1.441579
C  -2.723465 -2.822931 -0.152805
C  2.56776 2.170577 1.025596
C  3.081139 0.254597 -0.421796
C  -3.056313 3.084542 0.414675
C  -3.953069 -3.653945 -0.430299
C  5.214462 -0.638275 0.012314
C  6.318191 -0.445412 1.024093
H  0.680284 0.146747 -2.312275
H  0.612395 -0.847226 -0.873269
H  -1.656772 2.035918 1.678867
H  -3.266488 2.197946 2.371046
H  -2.105035 -3.279755 0.623806
H  -2.111987 -2.72907 -1.056159
H  2.788163 1.676498 1.969266
H  1.752169 2.866567 1.17621
H  3.443424 2.730241 0.703719
H  -4.118622 3.080244 0.172367
H  -2.483503 2.941283 -0.498848
H  -2.80694 4.067638 0.814911
H  -3.65638 -4.653137 -0.747801
H  -4.556467 -3.214156 -1.223195
H  -4.573077 -3.753636 0.459447
H  5.56695 -0.432632 -1.000574
H  4.840857 -1.664058 0.027946
H  6.710901 0.570587 1.002156
H  5.975441 -0.659857 2.035866
H  7.139072 -1.125527 0.798781
totalener: -1961.97584498 hartree
nucrepener: 2094.17459743 hartree
electener: -4056.15044241 hartree
oneelecener: -6866.10477226 hartree
twoeener: 2809.95432985 hartree
kineticenergy: 1956.40608238 hartree
xcener: -132.537067599809 hartree
chargesum: -0.0000000
charge: -0.153122 -0.416113 0.640244 -0.307087 -0.306201 -0.288639 -0.364763 -0.400210 -0.123113 -0.064161 0.233062 0.024752 0.016129 -0.175366 0.455667 -0.221138 -0.233124 0.026763 -0.230648 0.142011 0.116125 0.075158 0.097876 0.097894 0.081019 0.113592 0.118406 0.110664 0.087458 0.087286 0.075516 0.073844 0.085913 0.087831 0.091221 0.093025 0.083446 0.086736 0.082045
qa: -0.1531 -0.4161 0.6402 -0.3071 -0.3062 -0.2886 -0.3648 -0.4002 -0.1231 -0.0642 0.2331 0.0248 0.0161 -0.1754 0.4557 -0.2211 -0.2331 0.0268 -0.2306 0.1420 0.1161 0.0752 0.0979 0.0979 0.0810 0.1136 0.1184 0.1107 0.0875 0.0873 0.0755 0.0738 0.0859 0.0878 0.0912 0.0930 0.0834 0.0867 0.0820
va: 2.2845 2.0363 5.4351 2.1614 2.1482 2.1179 2.1125 2.0963 3.1722 3.8341 4.1354 3.9037 3.8748 3.8661 4.2792 3.9233 3.9681 3.8744 3.9549 1.0164 1.0493 1.0124 0.9924 1.0012 1.0008 0.9977 1.0255 0.9995 1.0051 1.0229 1.0119 1.0076 1.0061 1.0059 0.9996 0.9991 1.0049 1.0050 1.0091
dispcorr: -0.019022698 hartree
energy: -1961.994867675248
dipole: 9.93600 -8.59970 1.33629 -0.88954 0.76724 -0.12230 2.83443 -2.80384 0.03059
magnitude: 1.34223 au
magnitude: 3.41167 debye
