program: Orca
programVersion: 5.0.4
elementType: S S P O O O O O N C C C C C C C C C C H H H H H H H H H H H H H H H H H H H H
charge: 0
multiplicity: 1
keywords: wb97x-d3
keywords: def2-TZVPP
keywords: def2/J RIJCOSX
keywords: DEFGRID2
keywords: scfconv7
keywords: smallprint printgap noloewdin
keywords: NOSOSCF
formula: C10H20NO5PS2
InChI: InChI=1/C10H20NO5PS2/c1-5-14-10(13)11(4)9(12)8-19-17(18,15-6-2)16-7-3/h5-8H2,1-4H3
39 atoms
S  0.262848 -1.224182 0.52072
S  -2.836889 -0.320013 1.67678
P  -1.613367 -0.378525 0.194275
O  -1.208981 1.037362 -0.438596
O  -2.071422 -1.2289 -1.086888
O  3.476723 0.727677 -1.198913
O  0.63051 2.205825 1.93966
O  3.190324 -0.546336 0.618727
N  2.026101 1.413715 0.344558
C  0.796338 -0.146248 1.886618
C  1.15432 1.252492 1.424564
C  -2.054761 2.191203 -0.323024
C  -3.020553 -2.298561 -0.990802
C  1.991649 2.678759 -0.380172
C  2.921086 0.429363 -0.032096
C  -3.262753 2.10743 -1.227264
C  -2.437813 -3.535635 -0.345873
C  4.423372 -0.206513 -1.729056
C  3.748873 -1.386952 -2.392491
H  1.631391 -0.651978 2.364685
H  -0.013789 -0.051066 2.609789
H  -1.415859 3.029515 -0.598136
H  -2.350889 2.323006 0.719228
H  -3.318131 -2.498063 -2.01966
H  -3.901204 -1.958133 -0.441473
H  1.659789 2.524833 -1.405038
H  2.969453 3.156082 -0.390042
H  1.296907 3.341335 0.12211
H  -3.942523 1.316678 -0.910106
H  -2.975117 1.926782 -2.262478
H  -3.812825 3.048093 -1.188277
H  -1.536342 -3.868448 -0.859612
H  -3.167968 -4.344336 -0.388869
H  -2.196655 -3.36387 0.702998
H  5.106404 -0.535294 -0.944468
H  4.994439 0.37096 -2.454976
H  4.507154 -2.023336 -2.849938
H  3.194968 -1.99037 -1.675993
H  3.066699 -1.063424 -3.178029
totalener: -1961.97291104 hartree
nucrepener: 2169.65744732 hartree
electener: -4131.63035835 hartree
oneelecener: -7016.87045604 hartree
twoeener: 2885.24009768 hartree
kineticenergy: 1956.42391666 hartree
xcener: -132.541493175126 hartree
chargesum: 0.0000000
charge: -0.135295 -0.391975 0.598569 -0.325389 -0.332569 -0.288745 -0.331775 -0.410481 -0.116453 -0.066046 0.186717 0.025501 0.034479 -0.192595 0.456833 -0.222195 -0.250457 0.026480 -0.246577 0.150020 0.133870 0.084274 0.106748 0.095136 0.088814 0.118946 0.118750 0.110277 0.079460 0.087045 0.084578 0.089106 0.087291 0.092427 0.092010 0.095459 0.083365 0.099736 0.084659
qa: -0.1353 -0.3920 0.5986 -0.3254 -0.3326 -0.2887 -0.3318 -0.4105 -0.1165 -0.0660 0.1867 0.0255 0.0345 -0.1926 0.4568 -0.2222 -0.2505 0.0265 -0.2466 0.1500 0.1339 0.0843 0.1067 0.0951 0.0888 0.1189 0.1188 0.1103 0.0795 0.0870 0.0846 0.0891 0.0873 0.0924 0.0920 0.0955 0.0834 0.0997 0.0847
va: 2.2982 2.0434 5.4359 2.1126 2.1051 2.1277 2.1501 2.0698 3.1204 3.7957 4.1553 3.8703 3.8673 3.8749 4.2945 3.9132 3.8982 3.8808 3.9139 1.0134 1.0467 0.9902 1.0147 0.9910 1.0164 0.9931 1.0017 1.0242 1.0231 1.0063 1.0103 1.0040 1.0142 1.0191 1.0101 0.9944 1.0103 1.0130 1.0058
dispcorr: -0.021013345 hartree
energy: -1961.993924383981
dipole: 0.79151 -0.22267 0.56884 -1.10085 1.07259 -0.02826 -15.12221 13.42756 -1.69465
magnitude: 1.78779 au
magnitude: 4.54421 debye
