program: Orca
programVersion: 5.0.4
elementType: S S P O O O O O N C C C C C C C C C C H H H H H H H H H H H H H H H H H H H H
charge: 0
multiplicity: 1
keywords: wb97x-d3
keywords: def2-TZVPP
keywords: def2/J RIJCOSX
keywords: DEFGRID2
keywords: scfconv7
keywords: smallprint printgap noloewdin
keywords: NOSOSCF
formula: C10H20NO5PS2
InChI: InChI=1/C10H20NO5PS2/c1-5-14-10(13)11(4)9(12)8-19-17(18,15-6-2)16-7-3/h5-8H2,1-4H3
39 atoms
S  -0.41765 -0.335864 -1.396896
S  -1.216742 0.311581 1.881933
P  -1.813494 -0.262122 0.143051
O  -3.004686 0.582828 -0.504812
O  -2.350272 -1.770932 0.051373
O  3.360351 -0.354167 0.290294
O  0.468264 3.068932 0.096507
O  2.491262 0.191745 -1.701072
N  1.850534 1.280556 0.213881
C  0.035111 1.419434 -1.525064
C  0.80354 2.004761 -0.354503
C  -3.825105 1.48569 0.255524
C  -1.960517 -2.779787 0.990699
C  2.254863 1.612727 1.575997
C  2.560377 0.340704 -0.508831
C  -3.348878 2.909638 0.089625
C  -0.539829 -3.253216 0.775599
C  4.121062 -1.41253 -0.299996
C  3.305436 -2.680542 -0.426766
H  -0.864339 2.020968 -1.645366
H  0.611445 1.494814 -2.445769
H  -3.826337 1.203348 1.309866
H  -4.835701 1.356877 -0.131712
H  -2.670211 -3.591978 0.836742
H  -2.088654 -2.403851 2.008228
H  3.276254 1.988947 1.603962
H  2.171987 0.741013 2.219618
H  1.593391 2.38374 1.952062
H  -3.356138 3.211393 -0.957773
H  -2.341701 3.041759 0.484044
H  -4.012376 3.582191 0.634258
H  -0.326911 -4.081945 1.451535
H  0.17914 -2.460832 0.985059
H  -0.384336 -3.601932 -0.245204
H  4.960181 -1.558087 0.379025
H  4.516467 -1.101295 -1.267584
H  2.919918 -3.001509 0.540796
H  2.467426 -2.55133 -1.110142
H  3.934993 -3.48046 -0.817307
totalener: -1961.97164889 hartree
nucrepener: 2194.69712095 hartree
electener: -4156.66876984 hartree
oneelecener: -7067.01825517 hartree
twoeener: 2910.34948533 hartree
kineticenergy: 1956.41938801 hartree
xcener: -132.541343548641 hartree
chargesum: 0.0000000
charge: -0.119600 -0.409916 0.635443 -0.324152 -0.332478 -0.286832 -0.338256 -0.408196 -0.117612 -0.090292 0.197782 0.041775 0.028310 -0.186639 0.448932 -0.259563 -0.250030 0.030174 -0.256095 0.141667 0.150130 0.082681 0.095684 0.096275 0.092028 0.117990 0.113570 0.118788 0.083442 0.102924 0.087888 0.089659 0.071657 0.093818 0.096079 0.093096 0.082261 0.097557 0.090050
qa: -0.1196 -0.4099 0.6354 -0.3242 -0.3325 -0.2868 -0.3383 -0.4082 -0.1176 -0.0903 0.1978 0.0418 0.0283 -0.1866 0.4489 -0.2596 -0.2500 0.0302 -0.2561 0.1417 0.1501 0.0827 0.0957 0.0963 0.0920 0.1180 0.1136 0.1188 0.0834 0.1029 0.0879 0.0897 0.0717 0.0938 0.0961 0.0931 0.0823 0.0976 0.0900
va: 2.3063 2.0227 5.4164 2.1282 2.1300 2.1227 2.1318 2.0709 3.1296 3.8428 4.1499 3.8542 3.9026 3.8744 4.2936 3.9141 3.8868 3.8768 3.9122 1.0161 1.0144 1.0187 0.9929 0.9916 1.0151 1.0005 0.9991 1.0199 1.0020 1.0154 1.0162 1.0145 1.0203 1.0013 0.9942 1.0122 1.0027 1.0100 1.0135
dispcorr: -0.022334985 hartree
energy: -1961.993983874085
dipole: 4.82099 -4.46670 0.35429 -7.50118 6.49231 -1.00886 4.85795 -4.56201 0.29594
magnitude: 1.10946 au
magnitude: 2.82002 debye
