program: Orca
programVersion: 5.0.4
elementType: S S P O O O O O N C C C C C C C C C C H H H H H H H H H H H H H H H H H H H H
charge: 0
multiplicity: 1
keywords: wb97x-d3
keywords: def2-TZVPP
keywords: def2/J RIJCOSX
keywords: DEFGRID2
keywords: scfconv7
keywords: smallprint printgap noloewdin
keywords: NOSOSCF
formula: C10H20NO5PS2
InChI: InChI=1/C10H20NO5PS2/c1-5-14-10(13)11(4)9(12)8-19-17(18,15-6-2)16-7-3/h5-8H2,1-4H3
39 atoms
S  -0.345198 -0.476761 -1.539823
S  -1.043231 -0.014915 1.794708
P  -1.719617 -0.148715 -0.003623
O  -2.529872 1.114223 -0.549628
O  -2.714095 -1.377591 -0.271143
O  3.356595 -0.574086 0.537404
O  0.553668 2.867649 -0.115098
O  2.705366 -0.175485 -1.566065
N  1.936826 1.103408 0.184212
C  0.331466 1.19837 -1.754155
C  0.957291 1.804545 -0.513796
C  -3.074199 2.120226 0.318706
C  -2.728618 -2.557143 0.540191
C  2.22169 1.512988 1.556624
C  2.669583 0.078697 -0.390728
C  -4.333831 1.651475 1.00907
C  -1.579331 -3.482014 0.211997
C  4.230877 -1.616852 0.098265
C  5.55405 -1.079355 -0.401633
H  -0.465178 1.869179 -2.066196
H  1.048014 1.106638 -2.567175
H  -3.275312 2.968012 -0.334776
H  -2.316718 2.424587 1.042972
H  -3.686453 -3.031284 0.327448
H  -2.713021 -2.279903 1.596444
H  1.566628 2.336868 1.810897
H  3.253416 1.845138 1.659241
H  2.031373 0.694312 2.245101
H  -4.766446 2.47708 1.575184
H  -4.124844 0.844284 1.710674
H  -5.078325 1.308943 0.291195
H  -0.621551 -3.034157 0.479168
H  -1.561586 -3.735101 -0.847869
H  -1.680801 -4.408676 0.7776
H  3.74034 -2.223166 -0.663997
H  4.375841 -2.235842 0.982676
H  6.218402 -1.912153 -0.633829
H  5.433036 -0.489375 -1.308259
H  6.043147 -0.465723 0.354792
totalener: -1961.97148045 hartree
nucrepener: 2170.09197506 hartree
electener: -4132.06345551 hartree
oneelecener: -7017.99772931 hartree
twoeener: 2885.93427380 hartree
kineticenergy: 1956.42484483 hartree
xcener: -132.542280005667 hartree
chargesum: -0.0000000
charge: -0.130435 -0.415616 0.644968 -0.333842 -0.331861 -0.285393 -0.341159 -0.412532 -0.119455 -0.081547 0.189250 0.031979 0.030536 -0.185458 0.457027 -0.227570 -0.251552 0.027744 -0.250958 0.139103 0.146649 0.095094 0.097125 0.096296 0.089532 0.121331 0.115980 0.112565 0.083208 0.078463 0.088287 0.085352 0.093549 0.086405 0.091107 0.097533 0.084433 0.100389 0.083470
qa: -0.1304 -0.4156 0.6450 -0.3338 -0.3319 -0.2854 -0.3412 -0.4125 -0.1195 -0.0815 0.1893 0.0320 0.0305 -0.1855 0.4570 -0.2276 -0.2516 0.0277 -0.2510 0.1391 0.1466 0.0951 0.0971 0.0963 0.0895 0.1213 0.1160 0.1126 0.0832 0.0785 0.0883 0.0854 0.0935 0.0864 0.0911 0.0975 0.0844 0.1004 0.0835
va: 2.2963 2.0130 5.3994 2.1293 2.1208 2.1281 2.1360 2.0676 3.1406 3.8373 4.1641 3.8832 3.8779 3.8673 4.2855 3.9118 3.8963 3.8786 3.9130 1.0233 1.0161 0.9927 1.0132 0.9913 1.0161 1.0222 1.0019 1.0000 1.0108 1.0223 1.0063 1.0194 1.0036 1.0145 1.0116 0.9940 1.0105 1.0123 1.0056
dispcorr: -0.020853644 hartree
energy: -1961.992334091003
dipole: 4.50218 -4.18487 0.31731 -6.17137 5.40251 -0.76887 6.33864 -6.01541 0.32323
magnitude: 0.89237 au
magnitude: 2.26822 debye
