program: Orca
programVersion: 5.0.4
elementType: S S P O O O O O N C C C C C C C C C C H H H H H H H H H H H H H H H H H H H H
charge: 0
multiplicity: 1
keywords: wb97x-d3
keywords: def2-TZVPP
keywords: def2/J RIJCOSX
keywords: DEFGRID2
keywords: scfconv7
keywords: smallprint printgap noloewdin
keywords: NOSOSCF
formula: C10H20NO5PS2
InChI: InChI=1/C10H20NO5PS2/c1-5-14-10(13)11(4)9(12)8-19-17(18,15-6-2)16-7-3/h5-8H2,1-4H3
39 atoms
S  -1.03879 -0.471667 -1.816146
S  -1.038038 -0.62082 1.579622
P  -2.068106 -0.240768 -0.004612
O  -2.772821 1.181165 -0.096854
O  -3.353415 -1.164333 -0.267022
O  4.282758 0.381332 0.745026
O  0.275865 1.836294 -0.631414
O  3.323735 -0.788546 -0.903245
N  2.270674 1.026475 0.042742
C  0.675269 -0.426626 -1.241682
C  1.041702 0.909024 -0.616513
C  -2.676152 2.169616 0.934427
C  -3.223506 -2.588537 -0.257446
C  2.481596 2.208844 0.875762
C  3.301934 0.113855 -0.108125
C  -3.740851 1.967159 1.987581
C  -4.606425 -3.193408 -0.239963
C  5.459771 -0.430855 0.680842
C  6.410368 0.029088 -0.402311
H  1.278748 -0.626382 -2.126069
H  0.848875 -1.243737 -0.544049
H  -2.796187 3.124623 0.424739
H  -1.680751 2.151411 1.380759
H  -2.654245 -2.900345 0.622844
H  -2.667807 -2.908002 -1.143648
H  3.309463 2.809019 0.503195
H  2.685426 1.922086 1.904417
H  1.58229 2.811185 0.851047
H  -3.586586 1.031756 2.525109
H  -4.738153 1.957337 1.549048
H  -3.699123 2.779627 2.714152
H  -5.152283 -2.906367 0.657962
H  -4.52757 -4.28038 -0.252556
H  -5.187444 -2.888385 -1.109485
H  5.188945 -1.478552 0.54658
H  5.914667 -0.322344 1.664369
H  6.679495 1.077366 -0.27541
H  7.328132 -0.557305 -0.350764
H  5.986227 -0.10673 -1.395496
totalener: -1961.97404238 hartree
nucrepener: 2088.82137349 hartree
electener: -4050.79541587 hartree
oneelecener: -6855.60360857 hartree
twoeener: 2804.80819271 hartree
kineticenergy: 1956.41329833 hartree
xcener: -132.539702704745 hartree
chargesum: -0.0000000
charge: -0.136284 -0.430000 0.652811 -0.309993 -0.320288 -0.291090 -0.352895 -0.409931 -0.131882 -0.084547 0.236027 0.052144 0.017874 -0.174049 0.459837 -0.229673 -0.232122 0.028198 -0.249136 0.144114 0.130018 0.094286 0.074900 0.088754 0.083502 0.111399 0.112060 0.116462 0.081203 0.087228 0.077443 0.085072 0.074230 0.085979 0.091791 0.097260 0.083706 0.085727 0.099867
qa: -0.1363 -0.4300 0.6528 -0.3100 -0.3203 -0.2911 -0.3529 -0.4099 -0.1319 -0.0845 0.2360 0.0521 0.0179 -0.1740 0.4598 -0.2297 -0.2321 0.0282 -0.2491 0.1441 0.1300 0.0943 0.0749 0.0888 0.0835 0.1114 0.1121 0.1165 0.0812 0.0872 0.0774 0.0851 0.0742 0.0860 0.0918 0.0973 0.0837 0.0857 0.0999
va: 2.2978 2.0086 5.3933 2.1442 2.1356 2.1233 2.1187 2.0785 3.1875 3.8517 4.1271 3.8816 3.8873 3.8724 4.2749 3.9186 3.9623 3.8755 3.9143 1.0193 1.0384 0.9941 1.0150 1.0040 1.0008 0.9985 0.9981 1.0248 1.0209 1.0066 1.0110 1.0072 1.0076 1.0054 1.0116 0.9938 1.0053 1.0103 1.0121
dispcorr: -0.018391299 hartree
energy: -1961.992433679071
dipole: 6.07883 -4.85225 1.22658 -0.44033 0.43850 -0.00183 7.52867 -7.04968 0.47899
magnitude: 1.31679 au
magnitude: 3.34701 debye
