program: Orca
programVersion: 5.0.4
elementType: S S P O O O O O N C C C C C C C C C C H H H H H H H H H H H H H H H H H H H H
charge: 0
multiplicity: 1
keywords: wb97x-d3
keywords: def2-TZVPP
keywords: def2/J RIJCOSX
keywords: DEFGRID2
keywords: scfconv7
keywords: smallprint printgap noloewdin
keywords: NOSOSCF
formula: C10H20NO5PS2
InChI: InChI=1/C10H20NO5PS2/c1-5-14-10(13)11(4)9(12)8-19-17(18,15-6-2)16-7-3/h5-8H2,1-4H3
39 atoms
S  -1.199973 1.233137 -1.144803
S  -1.018337 -0.482239 1.78546
P  -2.132388 0.022565 0.296622
O  -3.434019 0.897553 0.628794
O  -2.861977 -1.138926 -0.507693
O  4.444263 -0.421963 0.013259
O  0.312775 -1.211641 -1.518174
O  3.135019 1.3803 -0.170502
N  2.365856 -0.720678 -0.726944
C  0.542363 1.014573 -0.72206
C  1.041448 -0.38503 -1.03517
C  -3.312229 2.102512 1.387391
C  -2.503528 -2.521917 -0.396668
C  2.769135 -2.113733 -0.91851
C  3.304538 0.194134 -0.274996
C  -4.697825 2.650583 1.629528
C  -3.426285 -3.229596 0.56712
C  5.532416 0.383851 0.479077
C  5.417594 0.711331 1.951495
H  0.698435 1.257767 0.327277
H  1.076004 1.764834 -1.303977
H  -2.700015 2.82277 0.836693
H  -2.806072 1.890085 2.332982
H  -1.464666 -2.624977 -0.082266
H  -2.587649 -2.928303 -1.40396
H  3.5807 -2.188497 -1.639256
H  1.919227 -2.667684 -1.295977
H  3.088319 -2.556861 0.021888
H  -5.307398 1.949753 2.198649
H  -5.208504 2.870222 0.692722
H  -4.627797 3.576626 2.200066
H  -4.46996 -3.123329 0.272593
H  -3.306963 -2.83938 1.577605
H  -3.188786 -4.294005 0.588154
H  5.610458 1.292542 -0.1194
H  6.41547 -0.22443 0.288073
H  5.317251 -0.192082 2.552446
H  6.321995 1.22659 2.27626
H  4.571663 1.364696 2.156032
totalener: -1961.97515224 hartree
nucrepener: 2082.40572418 hartree
electener: -4044.38087642 hartree
oneelecener: -6842.77603293 hartree
twoeener: 2798.39515651 hartree
kineticenergy: 1956.40324552 hartree
xcener: -132.538072645025 hartree
chargesum: -0.0000000
charge: -0.140988 -0.427094 0.643883 -0.316540 -0.311353 -0.290724 -0.364595 -0.410258 -0.142391 -0.079148 0.257899 0.017908 0.051390 -0.175302 0.465933 -0.231589 -0.223304 0.025380 -0.250322 0.129289 0.142602 0.082136 0.092140 0.073920 0.093203 0.109511 0.120503 0.111297 0.085446 0.085630 0.073300 0.086158 0.080543 0.075715 0.091705 0.096494 0.084632 0.084216 0.102775
qa: -0.1410 -0.4271 0.6439 -0.3165 -0.3114 -0.2907 -0.3646 -0.4103 -0.1424 -0.0791 0.2579 0.0179 0.0514 -0.1753 0.4659 -0.2316 -0.2233 0.0254 -0.2503 0.1293 0.1426 0.0821 0.0921 0.0739 0.0932 0.1095 0.1205 0.1113 0.0854 0.0856 0.0733 0.0862 0.0805 0.0757 0.0917 0.0965 0.0846 0.0842 0.1028
va: 2.2951 2.0138 5.4089 2.1409 2.1478 2.1227 2.1089 2.0780 3.2139 3.8463 4.1107 3.8795 3.8816 3.8665 4.2640 3.9637 3.9227 3.8813 3.9115 1.0429 1.0188 1.0036 1.0023 1.0160 0.9951 0.9989 1.0268 0.9982 1.0067 1.0056 1.0076 1.0067 1.0190 1.0109 1.0102 0.9937 1.0053 1.0098 1.0128
dispcorr: -0.018141107 hartree
energy: -1961.993293348369
dipole: 5.81453 -4.41359 1.40094 -2.84325 2.72034 -0.12291 9.26043 -9.06858 0.19185
magnitude: 1.41935 au
magnitude: 3.60770 debye
